BDBM50523631 CHEMBL4585734
SMILES Cc1ncnc2n(ccc12)[C@@H]1C[C@H](Oc2cccc3CCNCc23)[C@@H](O)[C@H]1O
InChI Key InChIKey=SFDOALJIDJMJFX-BTHPGYMESA-N
Data  1 IC50
  Tab Delimited (TSV)   2D SDfile   Computed 3D by Vconf -m prep SDfile
Find this compound or compounds like it in BindingDB:
Activity Spreadsheet -- Enzyme Inhibition Constant Data from BindingDB
Found 1 hit for monomerid = 50523631
TargetProtein arginine N-methyltransferase 5(Homo sapiens (Human))
Prelude Therapeutics
Curated by ChEMBL
LigandPNGBDBM50523631(CHEMBL4585734)
Affinity DataIC50:  1nM. Assay description: Inhibition of PRMT5 (unknown origin)
Ligand InfoPC cidPC sid
In DepthDetails ArticlePubMed