BDBM50523755 CHEBI:15430::PROTOPORPHYRIN::Protoporphyrin IX
SMILES Cc1c(CCC(O)=O)c2cc3[nH]c(cc4nc(cc5[nH]c(cc1n2)c(C)c5C=C)c(C)c4C=C)c(C)c3CCC(O)=O
InChI Key InChIKey=KSFOVUSSGSKXFI-UJJXFSCMSA-N
Data  6 IC50
  Tab Delimited (TSV)   2D SDfile   Computed 3D by Vconf -m prep SDfile
Find this compound or compounds like it in BindingDB:
Activity Spreadsheet -- Enzyme Inhibition Constant Data from BindingDB
Found 6 hits for monomerid = 50523755
TargetCo-chaperonin GroES(Escherichia coli)
Indiana University School Of Medicine
Curated by ChEMBL
LigandPNGBDBM50523755(CHEBI:15430 | PROTOPORPHYRIN | Protoporphyrin IX)
Affinity DataIC50:  3.00E+3nM. Assay description: Inhibition of Escherichia coli GroEL expressed in Escherichia coli DH5alpha/Escherichia coli GroES expressed in Escherichia coli BL21 (DE3) assessed ...
In DepthDetails ArticlePubMed
TargetThiosulfate sulfurtransferase(Homo sapiens)
Indiana University School Of Medicine
Curated by ChEMBL
LigandPNGBDBM50523755(CHEBI:15430 | PROTOPORPHYRIN | Protoporphyrin IX)
Affinity DataIC50: >1.00E+5nM. Assay description: Inhibition of native rhodanese (unknown origin) assessed as reduction in rhodanese enzyme activity after 45 mins by Fe(SCN)3 dye based spectrometric ...
In DepthDetails ArticlePubMed
TargetReplicase polyprotein 1ab(2019-nCoV)
Michigan State University
LigandPNGBDBM50523755(CHEBI:15430 | PROTOPORPHYRIN | Protoporphyrin IX)
Affinity DataIC50:  2.30E+4nM. Assay description: This is a review article. Please point to the original journal.
In DepthDetails ArticlePubMed
TargetChaperonin GroEL(Escherichia coli)
Indiana University School Of Medicine
Curated by ChEMBL
LigandPNGBDBM50523755(CHEBI:15430 | PROTOPORPHYRIN | Protoporphyrin IX)
Affinity DataIC50: >2.50E+5nM. Assay description: Inhibition of ATPase activity of Escherichia coli GroEL expressed in Escherichia coliDH5alpha incubated for 60 mins using ATP by spectrometric analys...
In DepthDetails ArticlePubMed
TargetCo-chaperonin GroES(Escherichia coli)
Indiana University School Of Medicine
Curated by ChEMBL
LigandPNGBDBM50523755(CHEBI:15430 | PROTOPORPHYRIN | Protoporphyrin IX)
Affinity DataIC50:  4.40E+3nM. Assay description: Inhibition of Escherichia coli GroEL expressed in Escherichia coliDH5alpha/Escherichia coli GroES expressed in Escherichia coli BL21 (DE3) assessed a...
In DepthDetails ArticlePubMed
Target60 kDa heat shock protein, mitochondrial(Homo sapiens)
Indiana University School Of Medicine
Curated by ChEMBL
LigandPNGBDBM50523755(CHEBI:15430 | PROTOPORPHYRIN | Protoporphyrin IX)
Affinity DataIC50:  4.90E+3nM. Assay description: Inhibition of human N-terminal octa-His-tagged HSP60 expressed in Escherichia coli Rosetta(DE3) pLysS/human HSP10 expressed in Escherichia coli Roset...
In DepthDetails ArticlePubMed