BDBM50524709 CHEMBL4471688
SMILES CCN(C)C(C)c1cc(OC(=O)N(C)CC)c2ncccc2c1
InChI Key InChIKey=BZBYEBQYIGACAU-UHFFFAOYSA-N
Data  1 IC50
  Tab Delimited (TSV)   2D SDfile   Computed 3D by Vconf -m prep SDfile
Find this compound or compounds like it in BindingDB:
Activity Spreadsheet -- Enzyme Inhibition Constant Data from BindingDB
Found 1 hit for monomerid = 50524709
TargetAcetylcholine receptor subunit epsilon(Rattus norvegicus)
Zhejiang Academy Of Medical Sciences
Curated by ChEMBL
LigandPNGBDBM50524709(CHEMBL4471688)
Affinity DataIC50:  4.07E+4nM. Assay description: Inhibition of rat brain cortex AChE using acetylthiocholine iodide as substrate incubated for 15 mins by spectrophotometry
Ligand InfoPC cidPC sid
In DepthDetails ArticlePubMed