BDBM50525110 CHEMBL4455570
SMILES CN1CCC(=CC1)c1nsnc1OCCCN1CCN(CCCCC2CCN(CC(=O)N3c4ccccc4NC(=O)c4ccccc34)CC2)CC1
InChI Key InChIKey=XFGSFWFIJFNGQY-UHFFFAOYSA-N
Data  5 KI
  Tab Delimited (TSV)   2D SDfile   Computed 3D by Vconf -m prep SDfile
Find this compound or compounds like it in BindingDB:
Activity Spreadsheet -- Enzyme Inhibition Constant Data from BindingDB
Found 5 hits for monomerid = 50525110
TargetMuscarinic acetylcholine receptor M2(Homo sapiens (Human))
University Of Regensburg
Curated by ChEMBL
LigandPNGBDBM50525110(CHEMBL4455570)
Affinity DataKi:  0.0794nM. Assay description: Displacement of [3H]-NMS from human muscarinic M2 receptor expressed in CHO-K9 cells after 3 hrs by microbeta2 scintillation counting method
Ligand InfoPC cidPC sid
In DepthDetails ArticlePubMed
TargetMuscarinic acetylcholine receptor M1(Homo sapiens (Human))
University Of Regensburg
Curated by ChEMBL
LigandPNGBDBM50525110(CHEMBL4455570)
Affinity DataKi:  1.40nM. Assay description: Displacement of [3H]-NMS from human muscarinic M1 receptor expressed in CHO-K9 cells after 3 hrs by microbeta2 scintillation counting method
Ligand InfoPC cidPC sid
In DepthDetails ArticlePubMed
TargetMuscarinic acetylcholine receptor M4(Homo sapiens (Human))
University Of Regensburg
Curated by ChEMBL
LigandPNGBDBM50525110(CHEMBL4455570)
Affinity DataKi:  2.60nM. Assay description: Displacement of [3H]-NMS from human muscarinic M4 receptor expressed in CHO-K9 cells after 3 hrs by microbeta2 scintillation counting method
Ligand InfoPC cidPC sid
In DepthDetails ArticlePubMed
TargetMuscarinic acetylcholine receptor M3(Homo sapiens (Human))
University Of Regensburg
Curated by ChEMBL
LigandPNGBDBM50525110(CHEMBL4455570)
Affinity DataKi:  13nM. Assay description: Displacement of [3H]-NMS from human muscarinic M3 receptor expressed in CHO-K9 cells after 3 hrs by microbeta2 scintillation counting method
Ligand InfoPC cidPC sid
In DepthDetails ArticlePubMed
TargetMuscarinic acetylcholine receptor M5(Homo sapiens (Human))
University Of Regensburg
Curated by ChEMBL
LigandPNGBDBM50525110(CHEMBL4455570)
Affinity DataKi:  34nM. Assay description: Displacement of [3H]-NMS from human muscarinic M5 receptor expressed in CHO-K9 cells after 3 hrs by microbeta2 scintillation counting method
Ligand InfoPC cidPC sid
In DepthDetails ArticlePubMed