BDBM50525967 CHEMBL4538007
SMILES Oc1ccc(Cl)c(C(=O)c2ccc(s2)-c2cccc(NS(=O)(=O)c3ccccc3)c2)c1F
InChI Key InChIKey=FFPPYOWUSBRLMV-UHFFFAOYSA-N
Data  3 IC50
  Tab Delimited (TSV)   2D SDfile   Computed 3D by Vconf -m prep SDfile
Find this compound or compounds like it in BindingDB:
Activity Spreadsheet -- Enzyme Inhibition Constant Data from BindingDB
Found 3 hits for monomerid = 50525967
Target17-beta-hydroxysteroid dehydrogenase type 2(Homo sapiens (Human))
Elexopharm
Curated by ChEMBL
LigandPNGBDBM50525967(CHEMBL4538007)
Affinity DataIC50:  8.5nM. Assay description: Inhibition of human placental microsomal fraction 17beta-HSD2 using [3H]-E2 as substrate in presence of NAD+ by radio-HPLC analysis
Ligand InfoPC cidPC sid
In DepthDetails ArticlePubMed
TargetEstradiol 17-beta-dehydrogenase 2(Mus musculus)
Elexopharm
Curated by ChEMBL
LigandPNGBDBM50525967(CHEMBL4538007)
Affinity DataIC50:  8.90nM. Assay description: Inhibition of mouse liver homogenate 17beta-HSD2 using [3H]-E2 as substrate in presence of NAD+ by radio-HPLC analysis
Ligand InfoPC cidPC sid
In DepthDetails ArticlePubMed
Target17-beta-hydroxysteroid dehydrogenase type 1(Homo sapiens (Human))
Elexopharm
Curated by ChEMBL
LigandPNGBDBM50525967(CHEMBL4538007)
Affinity DataIC50:  1.70nM. Assay description: Inhibition of human placental cytosolic fraction 17beta-HSD1 using [3H]-E1 as substrate in presence of NAD+ by radio-HPLC analysis
Ligand InfoPC cidPC sid
In DepthDetails ArticlePubMed