BDBM50525969 CHEMBL4529443
SMILES Cc1cccc(c1)S(=O)(=O)Nc1cccc(c1)-c1ccc(s1)C(=O)c1cc(F)c(F)c(O)c1F
InChI Key InChIKey=CXWWNZPMIDOSAZ-UHFFFAOYSA-N
Data  3 IC50
  Tab Delimited (TSV)   2D SDfile   Computed 3D by Vconf -m prep SDfile
Find this compound or compounds like it in BindingDB:
Activity Spreadsheet -- Enzyme Inhibition Constant Data from BindingDB
Found 3 hits for monomerid = 50525969
Target17-beta-hydroxysteroid dehydrogenase type 2(Homo sapiens (Human))
Elexopharm
Curated by ChEMBL
LigandPNGBDBM50525969(CHEMBL4529443)
Affinity DataIC50:  0.200nM. Assay description: Inhibition of human placental microsomal fraction 17beta-HSD2 using [3H]-E2 as substrate in presence of NAD+ by radio-HPLC analysis
Ligand InfoPC cidPC sid
In DepthDetails ArticlePubMed
TargetEstradiol 17-beta-dehydrogenase 2(Mus musculus)
Elexopharm
Curated by ChEMBL
LigandPNGBDBM50525969(CHEMBL4529443)
Affinity DataIC50:  7.90nM. Assay description: Inhibition of mouse liver homogenate 17beta-HSD2 using [3H]-E2 as substrate in presence of NAD+ by radio-HPLC analysis
Ligand InfoPC cidPC sid
In DepthDetails ArticlePubMed
Target17-beta-hydroxysteroid dehydrogenase type 1(Homo sapiens (Human))
Elexopharm
Curated by ChEMBL
LigandPNGBDBM50525969(CHEMBL4529443)
Affinity DataIC50:  0.100nM. Assay description: Inhibition of human placental cytosolic fraction 17beta-HSD1 using [3H]-E1 as substrate in presence of NAD+ by radio-HPLC analysis
Ligand InfoPC cidPC sid
In DepthDetails ArticlePubMed