BDBM50526084 CHEMBL4444498
SMILES FC(F)(F)Oc1ccc(Oc2ccnc(N3CCC(CC3)NC(=S)Nc3cccnc3)c2Cl)c(Cl)c1
InChI Key InChIKey=PIEQDBPBBQPLPL-UHFFFAOYSA-N
Data  1 IC50
  Tab Delimited (TSV)   2D SDfile   Computed 3D by Vconf -m prep SDfile
Find this compound or compounds like it in BindingDB:
Activity Spreadsheet -- Enzyme Inhibition Constant Data from BindingDB
Found 1 hit for monomerid = 50526084
TargetLysophosphatidylserine lipase ABHD12(Mus musculus)
The Scripps Research Institute
Curated by ChEMBL
LigandPNGBDBM50526084(CHEMBL4444498)
Affinity DataIC50:  11nM. Assay description: Inhibition of JJH350 binding to ABHD12 in mouse brain membrane proteome incubated for 20 mins by CuAAC fluorescence dependent gel-based competitive A...
In DepthDetails ArticlePubMed