BDBM50527292 CHEMBL4463475::US10829446, Compound 82
SMILES Cc1cnn(c1)-c1ccc(F)c(c1)C(=O)NNS(=O)(=O)c1ccccc1
InChI Key InChIKey=HHTCSKHUCWWNEW-UHFFFAOYSA-N
Data  2 IC50
  Tab Delimited (TSV)   2D SDfile   Computed 3D by Vconf -m prep SDfile
Find this compound or compounds like it in BindingDB:
Activity Spreadsheet -- Enzyme Inhibition Constant Data from BindingDB
Found 2 hits for monomerid = 50527292
TargetHistone acetyltransferase KAT6A [507-778](Homo sapiens)
Monash University
US Patent
LigandPNGBDBM50527292(CHEMBL4463475 | US10829446, Compound 82)
Affinity DataIC50:  221nM. Assay description: Active Moz protein was expressed as N-terminal fusion protein with a His6 tag in BL21 E. coli cells. Protein purification was performed via nickel-im...
Ligand InfoPC cidPC sid
In DepthDetails US Patent
TargetHistone acetyltransferase KAT6A [507-778](Homo sapiens)
Monash University
US Patent
LigandPNGBDBM50527292(CHEMBL4463475 | US10829446, Compound 82)
Affinity DataIC50:  220nM. Assay description: Inhibition of N-terminal NusA-fused His6-tagged human KAT6A (507 to 778 residues) expressed in Escherichia coli BL21 (DE3) cells using 0.4 uM acetyl ...
Ligand InfoPC cidPC sid
In DepthDetails ArticlePubMed