BDBM50528192 CHEMBL4434717
SMILES COc1cc(cc(F)c1C(N)=O)-c1cncc(c1C)-c1ccc(cc1)N1C[C@H](C)N(C)[C@H](C)C1
InChI Key InChIKey=JPQGOEWSQSKKFQ-CALCHBBNSA-N
Data  12 IC50
  Tab Delimited (TSV)   2D SDfile   Computed 3D by Vconf -m prep SDfile
Find this compound or compounds like it in BindingDB:
Activity Spreadsheet -- Enzyme Inhibition Constant Data from BindingDB
Found 12 hits for monomerid = 50528192
TargetActivin receptor type-1(Homo sapiens (Human))
University Of Toronto
Curated by ChEMBL
LigandPNGBDBM50528192(CHEMBL4434717)
Affinity DataIC50:  100nM. Assay description: Inhibition of C-terminal nanoluciferase-fused ALK2 (unknown origin) expressed in HEK293 cells incubated for 2 hrs followed by NanoBRET NanoGlo Substr...
Ligand InfoPC cidPC sid
In DepthDetails ArticlePubMed
TargetTGF-beta receptor type-1(Homo sapiens (Human))
University Of Toronto
Curated by ChEMBL
LigandPNGBDBM50528192(CHEMBL4434717)
Affinity DataIC50: >5.00E+3nM. Assay description: Inhibition of ALK5 (unknown origin) expressed in HEK293 cells transfected with CAGA-luciferase and Renilla luciferase reporter measured after 24 hrs ...
Ligand InfoPC cidPC sid
In DepthDetails ArticlePubMed
TargetPotassium voltage-gated channel subfamily H member 2(Homo sapiens (Human))
University Of Toronto
Curated by ChEMBL
LigandPNGBDBM50528192(CHEMBL4434717)
Affinity DataIC50:  1.90E+4nM. Assay description: Inhibition of human ERG expressed in HEK293 cells measured after 5 mins by whole cell patch clamp method
Ligand InfoPC cidPC sid
In DepthDetails ArticlePubMed
TargetCytochrome P450 1A2(Homo sapiens (Human))
University Of Toronto
Curated by ChEMBL
LigandPNGBDBM50528192(CHEMBL4434717)
Affinity DataIC50: >3.00E+4nM. Assay description: Inhibition of CYP1A2 in human liver microsomes using phenacetin as substrate incubated for 40 mins in presence of NADPH by LC-MS/MS analysis
Ligand InfoPC cidPC sid
In DepthDetails ArticlePubMed
TargetCytochrome P450 2C8(Homo sapiens (Human))
University Of Toronto
Curated by ChEMBL
LigandPNGBDBM50528192(CHEMBL4434717)
Affinity DataIC50: >3.00E+4nM. Assay description: Inhibition of CYP2C8 in human liver microsomes using paclitaxel as substrate incubated for 40 mins in presence of NADPH by LC-MS/MS analysis
Ligand InfoPC cidPC sid
In DepthDetails ArticlePubMed
TargetCytochrome P450 2C9(Homo sapiens (Human))
University Of Toronto
Curated by ChEMBL
LigandPNGBDBM50528192(CHEMBL4434717)
Affinity DataIC50: >3.00E+4nM. Assay description: Inhibition of CYP2C9 in human liver microsomes using tolbutamide as substrate incubated for 40 mins in presence of NADPH by LC-MS/MS analysis
Ligand InfoPC cidPC sid
In DepthDetails ArticlePubMed
TargetCytochrome P450 3A4(Homo sapiens (Human))
University Of Toronto
Curated by ChEMBL
LigandPNGBDBM50528192(CHEMBL4434717)
Affinity DataIC50: >3.00E+4nM. Assay description: Inhibition of CYP3A4 in human liver microsomes using midazolam as substrate incubated for 40 mins in presence of NADPH by LC-MS/MS analysis
Ligand InfoPC cidPC sid
In DepthDetails ArticlePubMed
TargetTGF-beta receptor type-1(Homo sapiens (Human))
University Of Toronto
Curated by ChEMBL
LigandPNGBDBM50528192(CHEMBL4434717)
Affinity DataIC50:  2.91E+3nM. Assay description: Inhibition of human ALK5 using casein as substrate in presence of 10 uM [gamma33P] ATP by radioactive assay
Ligand InfoPC cidPC sid
In DepthDetails ArticlePubMed
TargetCytochrome P450 2B6(Homo sapiens (Human))
University Of Toronto
Curated by ChEMBL
LigandPNGBDBM50528192(CHEMBL4434717)
Affinity DataIC50: >3.00E+4nM. Assay description: Inhibition of CYP2B6 in human liver microsomes using bupropion as substrate incubated for 40 mins in presence of NADPH by LC-MS/MS analysis
Ligand InfoPC cidPC sid
In DepthDetails ArticlePubMed
TargetCytochrome P450 2D6(Homo sapiens (Human))
University Of Toronto
Curated by ChEMBL
LigandPNGBDBM50528192(CHEMBL4434717)
Affinity DataIC50: >3.00E+4nM. Assay description: Inhibition of CYP2D6 in human liver microsomes using dextromethorrphan as substrate incubated for 40 mins in presence of NADPH by LC-MS/MS analysis
Ligand InfoPC cidPC sid
In DepthDetails ArticlePubMed
TargetActivin receptor type-1(Homo sapiens (Human))
University Of Toronto
Curated by ChEMBL
LigandPNGBDBM50528192(CHEMBL4434717)
Affinity DataIC50:  10nM. Assay description: Inhibition of human ALK2 using casein as substrate in presence of 10 uM [gamma33P] ATP by radioactive assay
Ligand InfoPC cidPC sid
In DepthDetails ArticlePubMed
TargetCytochrome P450 2C19(Homo sapiens (Human))
University Of Toronto
Curated by ChEMBL
LigandPNGBDBM50528192(CHEMBL4434717)
Affinity DataIC50: >3.00E+4nM. Assay description: Inhibition of CYP2C19 in human liver microsomes using mephenytoin as substrate incubated for 40 mins in presence of NADPH by LC-MS/MS analysis
Ligand InfoPC cidPC sid
In DepthDetails ArticlePubMed