BDBM50528204 CHEMBL4565968
SMILES COc1cc(cc(OC)c1C(N)=O)-c1cncc(c1C)-c1ccc(cc1)N1CCNCC1
InChI Key InChIKey=DDVZCQMFWBEKAW-UHFFFAOYSA-N
Data  4 IC50
  Tab Delimited (TSV)   2D SDfile   Computed 3D by Vconf -m prep SDfile
Find this compound or compounds like it in BindingDB:
Activity Spreadsheet -- Enzyme Inhibition Constant Data from BindingDB
Found 4 hits for monomerid = 50528204
TargetActivin receptor type-1(Homo sapiens (Human))
University Of Toronto
Curated by ChEMBL
LigandPNGBDBM50528204(CHEMBL4565968)
Affinity DataIC50:  178nM. Assay description: Inhibition of C-terminal nanoluciferase-fused ALK2 (unknown origin) expressed in HEK293 cells incubated for 2 hrs followed by NanoBRET NanoGlo Substr...
Ligand InfoPC cidPC sid
In DepthDetails ArticlePubMed
TargetActivin receptor type-1(Homo sapiens (Human))
University Of Toronto
Curated by ChEMBL
LigandPNGBDBM50528204(CHEMBL4565968)
Affinity DataIC50:  5nM. Assay description: Inhibition of human ALK2 using casein as substrate in presence of 10 uM [gamma33P] ATP by radioactive assay
Ligand InfoPC cidPC sid
In DepthDetails ArticlePubMed
TargetTGF-beta receptor type-1(Homo sapiens (Human))
University Of Toronto
Curated by ChEMBL
LigandPNGBDBM50528204(CHEMBL4565968)
Affinity DataIC50:  216nM. Assay description: Inhibition of ALK5 (unknown origin) expressed in HEK293 cells transfected with CAGA-luciferase and Renilla luciferase reporter measured after 24 hrs ...
Ligand InfoPC cidPC sid
In DepthDetails ArticlePubMed
TargetTGF-beta receptor type-1(Homo sapiens (Human))
University Of Toronto
Curated by ChEMBL
LigandPNGBDBM50528204(CHEMBL4565968)
Affinity DataIC50:  46nM. Assay description: Inhibition of human ALK5 using casein as substrate in presence of 10 uM [gamma33P] ATP by radioactive assay
Ligand InfoPC cidPC sid
In DepthDetails ArticlePubMed