BDBM50529393 CHEMBL4564479::US11731973, Example 24
SMILES CC(C)n1nc(-c2ccc3oc(N)nc3c2)c2cnc(N)nc12
InChI Key InChIKey=AWOSFEUBLOFLFP-UHFFFAOYSA-N
Data  3 KI  2 IC50
  Tab Delimited (TSV)   2D SDfile   Computed 3D by Vconf -m prep SDfile
Find this compound or compounds like it in BindingDB:
Activity Spreadsheet -- Enzyme Inhibition Constant Data from BindingDB
Found 5 hits for monomerid = 50529393
TargetSerine/threonine-protein kinase mTOR(Homo sapiens (Human))
Nestl�
Curated by ChEMBL
LigandPNGBDBM50529393(CHEMBL4564479 | US11731973, Example 24)
Affinity DataKi:  6nM. Assay description: Inhibition of human recombinant GST-tagged mTOR catalytic domain (1360 to 2549 residues) expressed in baculovirus expression system using GFP-4E-BP1 ...
Ligand InfoPC cidPC sid
In DepthDetails ArticlePubMed
TargetSerine/threonine-protein kinase mTOR(Homo sapiens (Human))
Nestl�
Curated by ChEMBL
LigandPNGBDBM50529393(CHEMBL4564479 | US11731973, Example 24)
Affinity DataKi:  6.10nM. Assay description: The model for screening the inhibitory activity of the molecules on mTOR was developed with the LANTHASCREEN™ technology (Lifetechnologies). The...
Ligand InfoPC cidPC sid
In DepthDetails US Patent
LigandPNGBDBM50529393(CHEMBL4564479 | US11731973, Example 24)
Affinity DataKi:  780nM. Assay description: Inhibition of PI3Kalpha (unknown origin) using PIP2 as substrate measured after 30 mins by TR-FRET assay
Ligand InfoPC cidPC sid
In DepthDetails ArticlePubMed
TargetTarget of rapamycin complex subunit LST8(Homo sapiens)
Nestl�
Curated by ChEMBL
LigandPNGBDBM50529393(CHEMBL4564479 | US11731973, Example 24)
Affinity DataIC50:  7nM. Assay description: Inhibition of mTORC1 in human A431 cells assessed as S6RP phosphorylation incubated for 3 hrs by HTRF assay
Ligand InfoPC cidPC sid
In DepthDetails ArticlePubMed
TargetTarget of rapamycin complex 2 subunit MAPKAP1(Homo sapiens)
Nestl�
Curated by ChEMBL
LigandPNGBDBM50529393(CHEMBL4564479 | US11731973, Example 24)
Affinity DataIC50:  5nM. Assay description: Inhibition of mTORC2 in human A431 cells assessed as AKT phosphorylation at S473 residue incubated for 3 hrs by HTRF assay
Ligand InfoPC cidPC sid
In DepthDetails ArticlePubMed