BDBM50529739 CHEMBL4436259
SMILES CC(C)Cc1nnc(SCc2ccc(cc2)C(=O)Nc2cccnc2)n1Cc1ccccc1
InChI Key InChIKey=IECVHYSMMLVWMH-UHFFFAOYSA-N
Data  2 IC50
  Tab Delimited (TSV)   2D SDfile   Computed 3D by Vconf -m prep SDfile
Find this compound or compounds like it in BindingDB:
Activity Spreadsheet -- Enzyme Inhibition Constant Data from BindingDB
Found 2 hits for monomerid = 50529739
TargetRetinal rod rhodopsin-sensitive cGMP 3',5'-cyclic phosphodiesterase subunit delta(Homo sapiens (Human))
Chinese Academy Of Sciences
Curated by ChEMBL
LigandPNGBDBM50529739(CHEMBL4436259)
Affinity DataIC50:  1.01E+3nM. Assay description: Inhibition of N-terminal His6-tagged PDEdelta (unknown origin) expressed in Escherichia coli BL21(DE3)-condon plus-RIL cells after 4 hrs by fluoresce...
Ligand InfoPC cidPC sid
In DepthDetails ArticlePubMed
TargetRetinal rod rhodopsin-sensitive cGMP 3',5'-cyclic phosphodiesterase subunit delta(Homo sapiens (Human))
Chinese Academy Of Sciences
Curated by ChEMBL
LigandPNGBDBM50529739(CHEMBL4436259)
Affinity DataIC50:  1.01E+3nM. Assay description: Inhibition of N-terminal His6-tagged PDEdelta (unknown origin) expressed in Escherichia coli BL21(DE3)-condon plus-RIL cells after 4 hrs by fluoresce...
Ligand InfoPC cidPC sid
In DepthDetails ArticlePubMed