BDBM50529741 CHEMBL4590921
SMILES CC(C)Cc1nnc(SCc2ccc(cc2)C(=O)Nc2cccc(c2)C(F)(F)F)n1Cc1ccccc1
InChI Key InChIKey=KLALZRIRNQGYNX-UHFFFAOYSA-N
Data  2 IC50
  Tab Delimited (TSV)   2D SDfile   Computed 3D by Vconf -m prep SDfile
Find this compound or compounds like it in BindingDB:
Activity Spreadsheet -- Enzyme Inhibition Constant Data from BindingDB
Found 2 hits for monomerid = 50529741
TargetRetinal rod rhodopsin-sensitive cGMP 3',5'-cyclic phosphodiesterase subunit delta(Homo sapiens (Human))
Chinese Academy Of Sciences
Curated by ChEMBL
LigandPNGBDBM50529741(CHEMBL4590921)
Affinity DataIC50:  61nM. Assay description: Inhibition of N-terminal His6-tagged PDEdelta (unknown origin) expressed in Escherichia coli BL21(DE3)-condon plus-RIL cells after 4 hrs by fluoresce...
Ligand InfoPC cidPC sid
In DepthDetails ArticlePubMed
TargetRetinal rod rhodopsin-sensitive cGMP 3',5'-cyclic phosphodiesterase subunit delta(Homo sapiens (Human))
Chinese Academy Of Sciences
Curated by ChEMBL
LigandPNGBDBM50529741(CHEMBL4590921)
Affinity DataIC50:  61nM. Assay description: Inhibition of N-terminal His6-tagged PDEdelta (unknown origin) expressed in Escherichia coli BL21(DE3)-condon plus-RIL cells after 4 hrs by fluoresce...
Ligand InfoPC cidPC sid
In DepthDetails ArticlePubMed