BDBM50531806 CHEMBL4460323
SMILES CC(C)C[C@H](NC(=O)N1CCC(CC1)C(=O)Nc1nccs1)C(=O)N[C@@H](Cc1ccccc1)C(=O)N[C@@H](CC(C)C)C(=O)[C@@]1(C)CO1
InChI Key InChIKey=CNESNQPFWCQFHS-CBUCOWSNSA-N
Data  4 IC50
  Tab Delimited (TSV)   2D SDfile   Computed 3D by Vconf -m prep SDfile
Find this compound or compounds like it in BindingDB:
Activity Spreadsheet -- Enzyme Inhibition Constant Data from BindingDB
Found 4 hits for monomerid = 50531806
TargetProteasome subunit beta type-5(Homo sapiens (Human))
Hangzhou Institute Of Innovative Medicine
Curated by ChEMBL
LigandPNGBDBM50531806(CHEMBL4460323)
Affinity DataIC50:  1.5nM. Assay description: Inhibition of human 20s constitutive proteasome beta5 chymotrypsin-like activity using Suc-LLVY-AMC as substrate preincubated for 15 mins followed by...
Ligand InfoPC cidPC sid
In DepthDetails ArticlePubMed
TargetProteasome subunit beta type-8(Homo sapiens (Human))
Hangzhou Institute Of Innovative Medicine
Curated by ChEMBL
LigandPNGBDBM50531806(CHEMBL4460323)
Affinity DataIC50:  32nM. Assay description: Inhibition of human 20s immunoproteasome beta5i activity using Suc-LLVY-AMC as substrate preincubated for 15 mins followed by substrate addition
Ligand InfoPC cidPC sid
In DepthDetails ArticlePubMed
TargetProteasome subunit beta type-2(Homo sapiens (Human))
Hangzhou Institute Of Innovative Medicine
Curated by ChEMBL
LigandPNGBDBM50531806(CHEMBL4460323)
Affinity DataIC50:  1.26E+3nM. Assay description: Inhibition of human 20s proteasome subunit beta2 caspase-like activity using Z-LLE-AMC as substrate preincubated for 15 mins followed by substrate ad...
Ligand InfoPC cidPC sid
In DepthDetails ArticlePubMed
LigandPNGBDBM50531806(CHEMBL4460323)
Affinity DataIC50:  1.5nM. Assay description: Inhibition of human 20S proteasome preincubated for 15 mins followed by substrate addition
Ligand InfoPC cidPC sid
In DepthDetails ArticlePubMed