BDBM50534236 CHEMBL4563476
SMILES Cc1nc(CN2C3=NCCN3c3nc(N4CCC[C@@H](N)C4)n(Cc4cc(F)cs4)c3C2=O)nc2ccccc12
InChI Key InChIKey=FNQXLTOKENXKAZ-GOSISDBHSA-N
Data  2 IC50
  Tab Delimited (TSV)   2D SDfile   Computed 3D by Vconf -m prep SDfile
Find this compound or compounds like it in BindingDB:
Activity Spreadsheet -- Enzyme Inhibition Constant Data from BindingDB
Found 2 hits for monomerid = 50534236
TargetAcyl-protein thioesterase 1(Rattus norvegicus)
Merck Research Laboratories
Curated by ChEMBL
LigandPNGBDBM50534236(CHEMBL4563476)
Affinity DataIC50:  1.14E+4nM. Assay description: Inhibition of FAP (unknown origin) using Nle-Pro-AMC as substrate preincubated for 20 mins followed by substrate addition measured after 40 mins by f...
Ligand InfoPC cidPC sid
In DepthDetails ArticlePubMed
TargetDipeptidyl peptidase 4(Homo sapiens (Human))
Merck Research Laboratories
Curated by ChEMBL
LigandPNGBDBM50534236(CHEMBL4563476)
Affinity DataIC50:  29nM. Assay description: Inhibition of DPP4 (unknown origin) using Gly-Pro-AMC as substrate preincubated for 30 mins followed by substrate addition measured after 50 mins by ...
Ligand InfoPC cidPC sid
In DepthDetails ArticlePubMed