BDBM50535821 CHEMBL4583139
SMILES Brc1ccc(cc1)\N=c1/n2CCc3cc4OCOc4cc3-c2cc2ccc3OCOc3c12
InChI Key InChIKey=WHMZLYYHBAXRSE-RFBIWTDZSA-N
Data  1 EC50
  Tab Delimited (TSV)   2D SDfile   Computed 3D by Vconf -m prep SDfile
Find this compound or compounds like it in BindingDB:
Activity Spreadsheet -- Enzyme Inhibition Constant Data from BindingDB
Found 1 hit for monomerid = 50535821
TargetX-box-binding protein 1(Rattus norvegicus)
Chinese Academy Of Medical Sciences And Peking Union Medical College
Curated by ChEMBL
LigandPNGBDBM50535821(CHEMBL4583139)
Affinity DataEC50:  49nM. Assay description: Activation of XBP1 in rat IEC-6 cells assessed as transcriptional activity measured after 48 hrs by dual luciferase reporter gene assay
Ligand InfoPC cidPC sid
In DepthDetails ArticlePubMed