BDBM50535848 CHEMBL4584997
SMILES CCCCCCC(=O)c1cc(-c2ccc(CC(O)=O)cc2)c2nccn2c1
InChI Key InChIKey=MMYRYMMKMUTPBB-UHFFFAOYSA-N
Data  1 IC50  1 EC50
  Tab Delimited (TSV)   2D SDfile   Computed 3D by Vconf -m prep SDfile
Find this compound or compounds like it in BindingDB:
Activity Spreadsheet -- Enzyme Inhibition Constant Data from BindingDB
Found 2 hits for monomerid = 50535848
TargetSerine palmitoyltransferase 1(Homo sapiens (Human))
Eli Lilly
Curated by ChEMBL
LigandPNGBDBM50535848(CHEMBL4584997)
Affinity DataIC50:  5.20nM. Assay description: Inhibition of human SPT1 expressed in microsomes of HEK293 cells incubated for 1hr by LC/MS analysis
In DepthDetails ArticlePubMed
TargetSerine palmitoyltransferase 1(Homo sapiens (Human))
Eli Lilly
Curated by ChEMBL
LigandPNGBDBM50535848(CHEMBL4584997)
Affinity DataEC50:  977nM. Assay description: Inhibition of SPT1 in human MCF7 cells assessed as suppression of 14C-serine incorporation into ceramide incubated for 2 hrs in presence of 4-HPR
In DepthDetails ArticlePubMed