BDBM50538810 CHEMBL4647581
SMILES CC(C)C[C@H](NC(=O)[C@H](CO)NC(=O)[C@H](CCCC[N+](C)(C)C)NC(=O)[C@H](Cc1ccc(O)cc1)NC(=O)[C@H](C)NC(=O)[C@H](Cc1ccccc1)NC(=O)c1ccc(Br)cc1)C(=O)N[C@@H](CCCCNC(=S)Nc1ccc(c(c1)C(O)=O)-c1c2ccc(O)cc2oc2cc(=O)ccc12)C(N)=O
InChI Key InChIKey=RTZWWZLSYSTNKU-VJMNTWHBSA-O
Data  4 Kd
  Tab Delimited (TSV)   2D SDfile   Computed 3D by Vconf -m prep SDfile
Find this compound or compounds like it in BindingDB:
Activity Spreadsheet -- Enzyme Inhibition Constant Data from BindingDB
Found 4 hits for monomerid = 50538810
TargetChromobox protein homolog 1(Homo sapiens (Human))
University Of Victoria
Curated by ChEMBL
LigandPNGBDBM50538810(CHEMBL4647581)
Affinity DataKd:  1.75E+3nM. Assay description: Binding affinity to CBX1 (unknown origin) assessed as dissociation constant by fluorescence polarization analysis
Ligand InfoKEGGPC cidPC sid
In DepthDetails ArticlePubMed
TargetChromobox protein homolog 8(Homo sapiens (Human))
University Of Victoria
Curated by ChEMBL
LigandPNGBDBM50538810(CHEMBL4647581)
Affinity DataKd:  890nM. Assay description: Binding affinity to CBX8 (unknown origin) assessed as dissociation constant by fluorescence polarization analysis
Ligand InfoKEGGPC cidPC sid
In DepthDetails ArticlePubMed
TargetChromobox protein homolog 7(Homo sapiens (Human))
University Of Victoria
Curated by ChEMBL
LigandPNGBDBM50538810(CHEMBL4647581)
Affinity DataKd:  11nM. Assay description: Binding affinity to CBX7 (unknown origin) assessed as dissociation constant by fluorescence polarization analysis
Ligand InfoKEGGPC cidPC sid
In DepthDetails ArticlePubMed
TargetChromobox protein homolog 6(Homo sapiens (Human))
University Of Victoria
Curated by ChEMBL
LigandPNGBDBM50538810(CHEMBL4647581)
Affinity DataKd:  78nM. Assay description: Binding affinity to CBX6 (unknown origin) assessed as dissociation constant by fluorescence polarization analysis
Ligand InfoKEGGPC cidPC sid
In DepthDetails ArticlePubMed