BDBM50542017 CHEMBL4644019
SMILES CCOc1ccc(C(=O)N2[C@H](C)CN(C[C@H]2C)C(=O)c2ccc(OC)cc2F)c(F)c1
InChI Key InChIKey=BAMXKJKQDZCLNC-HUUCEWRRSA-N
Data  1 IC50
  Tab Delimited (TSV)   2D SDfile   Computed 3D by Vconf -m prep SDfile
Find this compound or compounds like it in BindingDB:
Activity Spreadsheet -- Enzyme Inhibition Constant Data from BindingDB
Found 1 hit for monomerid = 50542017
TargetCarbamoyl-phosphate synthase [ammonia], mitochondrial(Homo sapiens)
H3 Biomedicine
Curated by ChEMBL
LigandPNGBDBM50542017(CHEMBL4644019)
Affinity DataIC50:  380nM. Assay description: Allosteric inhibition of His-tagged CPS1 (unknown origin) expressed in baculovirus infected Sf21 insect cells assessed as reduction in ADP level prei...
Ligand InfoPC cidPC sid
In DepthDetails ArticlePubMed