BDBM50542266 CHEMBL4633397
SMILES Fc1cccn2c1nn(CCCCN1CCN(CC1)c1cccc3scnc13)c2=O
InChI Key InChIKey=FGEAKGKYBVSAPW-UHFFFAOYSA-N
Data  2 IC50  1 EC50
  Tab Delimited (TSV)   2D SDfile   Computed 3D by Vconf -m prep SDfile
Find this compound or compounds like it in BindingDB:
Activity Spreadsheet -- Enzyme Inhibition Constant Data from BindingDB
Found 3 hits for monomerid = 50542266
TargetD(2) dopamine receptor(Homo sapiens (Human))
University Of Chinese Academy Of Sciences
Curated by ChEMBL
LigandPNGBDBM50542266(CHEMBL4633397)
Affinity DataIC50:  7nM. Assay description: Antagonist activity at D2 receptor (unknown origin) by HTRF cAMP assay
Ligand InfoPC cidPC sid
In DepthDetails ArticlePubMed
Target5-hydroxytryptamine receptor 2A(Homo sapiens (Human))
University Of Chinese Academy Of Sciences
Curated by ChEMBL
LigandPNGBDBM50542266(CHEMBL4633397)
Affinity DataIC50:  78nM. Assay description: Antagonist activity at 5HT2A receptor (unknown origin) by HTRF cAMP assay
Ligand InfoPC cidPC sid
In DepthDetails ArticlePubMed
Target5-hydroxytryptamine receptor 1A(Homo sapiens (Human))
University Of Chinese Academy Of Sciences
Curated by ChEMBL
LigandPNGBDBM50542266(CHEMBL4633397)
Affinity DataEC50:  0.100nM. Assay description: Agonist activity at 5HT1A receptor (unknown origin) by calcium-dye based FLIPR assay
Ligand InfoPC cidPC sid
In DepthDetails ArticlePubMed