BDBM50679 (5Z)-5-(2-furanylmethylidene)-3-(3-pyridinyl)-2-sulfanylidene-4-thiazolidinone::(5Z)-5-(2-furfurylidene)-3-(3-pyridyl)-2-thioxo-thiazolidin-4-one::(5Z)-5-(furan-2-ylmethylidene)-3-pyridin-3-yl-2-sulfanylidene-1,3-thiazolidin-4-one::CHEMBL1609550::MLS001005166::SMR000378042::cid_1591868
SMILES O=C1N(C(=S)S\C1=C/c1ccco1)c1cccnc1
InChI Key InChIKey=FMAMMNRLZOOXEN-XFFZJAGNSA-N
Data  7 IC50
  Tab Delimited (TSV)   2D SDfile   Computed 3D by Vconf -m prep SDfile
Find this compound or compounds like it in BindingDB:
Activity Spreadsheet -- Enzyme Inhibition Constant Data from BindingDB
Found 7 hits for monomerid = 50679
TargetGlycoprotein 42(Human herpesvirus 4 type 2)
Emory University
Curated by PubChem BioAssay
LigandPNGBDBM50679((5Z)-5-(2-furanylmethylidene)-3-(3-pyridinyl)-2-su...)
Affinity DataIC50:  5.00E+3nM. Assay description: NIH Molecular Libraries Screening Centers Network [MLSCN] Emory Chemical Biology Discovery Center in MLSCN Assay provider: Theodore Jardetzky; Northw...
In DepthDetails PCBioAssay
TargetInduced myeloid leukemia cell differentiation protein Mcl-1(Homo sapiens (Human))
Emory University
Curated by PubChem BioAssay
LigandPNGBDBM50679((5Z)-5-(2-furanylmethylidene)-3-(3-pyridinyl)-2-su...)
Affinity DataIC50:  3.16E+3nM. Assay description: NIH Molecular Libraries Screening Centers Network [MLSCN] Emory Chemical Biology Discovery Center in MLSCN Assay provider: Nikolovska-Coleska, Univer...
In DepthDetails PCBioAssay
TargetAlbumin(Bos taurus)
The Scripps Research Institute Molecular Screening Center
Curated by PubChem BioAssay
LigandPNGBDBM50679((5Z)-5-(2-furanylmethylidene)-3-(3-pyridinyl)-2-su...)
Affinity DataIC50: >9.41E+4nM
In DepthDetails PCBioAssay
TargetMitogen-activated protein kinase kinase kinase 5(Homo sapiens (Human))
Nas Of Ukraine
Curated by ChEMBL
LigandPNGBDBM50679((5Z)-5-(2-furanylmethylidene)-3-(3-pyridinyl)-2-su...)
Affinity DataIC50: >3.30E+4nM. Assay description: Inhibition of human ASK1 using MBP as substrate incubated for 10 mins prior to ATP addition measured after 20 mins by liquid scintillation counting a...
In DepthDetails ArticlePubMed
Target1-phosphatidylinositol 4,5-bisphosphate phosphodiesterase gamma-1 [1-999,I813T](Homo sapiens (Human))
The Scripps Research Institute Molecular Screening Center
Curated by PubChem BioAssay
LigandPNGBDBM50679((5Z)-5-(2-furanylmethylidene)-3-(3-pyridinyl)-2-su...)
Affinity DataIC50:  1.22E+5nM. Assay description: Source (MLPCN Center Name): The Scripps Research Institute Molecular Screening Center (SRIMSC) Center Affiliation: The Scripps Research Institute Ass...
In DepthDetails PCBioAssay
Target1-phosphatidylinositol 4,5-bisphosphate phosphodiesterase beta-3(Homo sapiens (Human))
The Scripps Research Institute Molecular Screening Center
Curated by PubChem BioAssay
LigandPNGBDBM50679((5Z)-5-(2-furanylmethylidene)-3-(3-pyridinyl)-2-su...)
Affinity DataIC50:  1.22E+5nM. Assay description: Source (MLPCN Center Name): The Scripps Research Institute Molecular Screening Center (SRIMSC) Center Affiliation: The Scripps Research Institute Ass...
In DepthDetails PCBioAssay
TargetT cell receptor alpha variable 4(Homo sapiens (Human))
The Scripps Research Institute Molecular Screening Center
Curated by PubChem BioAssay
LigandPNGBDBM50679((5Z)-5-(2-furanylmethylidene)-3-(3-pyridinyl)-2-su...)
Affinity DataIC50: >9.41E+4nM
In DepthDetails PCBioAssay