BDBM50697 3-[[4-chloranyl-2-oxidanylidene-5-[[(3-oxidanylnaphthalen-2-yl)carbonylhydrazinylidene]methyl]-1,3-thiazol-3-yl]methyl]benzoic acid::3-[[4-chloro-5-[[(3-hydroxy-2-naphthoyl)hydrazono]methyl]-2-keto-4-thiazolin-3-yl]methyl]benzoic acid::3-[[4-chloro-5-[[(3-hydroxynaphthalene-2-carbonyl)hydrazinylidene]methyl]-2-oxo-1,3-thiazol-3-yl]methyl]benzoic acid::3-[[4-chloro-5-[[[(3-hydroxy-2-naphthalenyl)-oxomethyl]hydrazinylidene]methyl]-2-oxo-3-thiazolyl]methyl]benzoic acid::3-{4-Chloro-5-[(3-hydroxy-naphthalene-2-carbonyl)-hydrazonomethyl]-2-oxo-thiazol-3-ylmethyl}-benzoic acid::MLS001044526::SMR000415051::cid_1864796
SMILES OC(=O)c1cccc(Cn2c(Cl)c(C=NNC(=O)c3cc4ccccc4cc3O)sc2=O)c1
InChI Key InChIKey=JTKJNYPWSRXMMI-UHFFFAOYSA-N
Data  3 IC50
  Tab Delimited (TSV)   2D SDfile   Computed 3D by Vconf -m prep SDfile
Find this compound or compounds like it in BindingDB:
Activity Spreadsheet -- Enzyme Inhibition Constant Data from BindingDB
Found 3 hits for monomerid = 50697
TargetInduced myeloid leukemia cell differentiation protein Mcl-1(Homo sapiens (Human))
Emory University
Curated by PubChem BioAssay
LigandPNGBDBM50697(3-[[4-chloranyl-2-oxidanylidene-5-[[(3-oxidanylnap...)
Affinity DataIC50:  3.74E+3nM. Assay description: NIH Molecular Libraries Screening Centers Network [MLSCN] Emory Chemical Biology Discovery Center in MLSCN Assay provider: Nikolovska-Coleska, Univer...
In DepthDetails PCBioAssay
TargetSUMO-activating enzyme subunit 1(Homo sapiens (Human))
Burnham Center For Chemical Genomics
Curated by PubChem BioAssay
LigandPNGBDBM50697(3-[[4-chloranyl-2-oxidanylidene-5-[[(3-oxidanylnap...)
Affinity DataIC50:  2.41E+4nM. Assay description: Data Source: Sanford-Burnham Center for Chemical Genomics (SBCCG) Source Affiliation: Sanford-Burnham Medical Research Institute (SBMRI, San Diego, C...
In DepthDetails PCBioAssay
TargetSUMO-conjugating enzyme UBC9(Homo sapiens (Human))
Burnham Center For Chemical Genomics
Curated by PubChem BioAssay
LigandPNGBDBM50697(3-[[4-chloranyl-2-oxidanylidene-5-[[(3-oxidanylnap...)
Affinity DataIC50:  1.86E+3nM. Assay description: Data Source: Sanford-Burnham Center for Chemical Genomics (SBCCG) Source Affiliation: Sanford-Burnham Medical Research Institute (SBMRI, San Diego, C...
In DepthDetails PCBioAssay