BDBM50703 3-[1-(3,4-Dihydroxy-phenyl)-meth-(E)-ylidene]-4-imino-7-methanesulfonyl-3,4-dihydro-9-thia-1,4a-diaza -fluoren-2-one::4-amino-3-[(Z)-(3-hydroxy-4-keto-cyclohexa-2,5-dien-1-ylidene)methyl]-8-mesyl-pyrimido[2,1-b][1,3]benzothiazol-2-one::4-amino-3-[(Z)-(3-hydroxy-4-oxo-1-cyclohexa-2,5-dienylidene)methyl]-8-methylsulfonyl-2-pyrimido[2,1-b][1,3]benzothiazolone::4-amino-3-[(Z)-(3-hydroxy-4-oxocyclohexa-2,5-dien-1-ylidene)methyl]-8-methylsulfonylpyrimido[2,1-b][1,3]benzothiazol-2-one::4-azanyl-8-methylsulfonyl-3-[(Z)-(3-oxidanyl-4-oxidanylidene-cyclohexa-2,5-dien-1-ylidene)methyl]pyrimido[2,1-b][1,3]benzothiazol-2-one::MLS000779134::SMR000415838::cid_16682713
SMILES CS(=O)(=O)c1ccc2c(c1)sc1nc(=O)c(\C=C3\C=CC(=O)C(O)=C3)c(N)n21
InChI Key InChIKey=WPNXSSIQPFCMBG-TWGQIWQCSA-N
Data  7 IC50  4 EC50
  Tab Delimited (TSV)   2D SDfile   Computed 3D by Vconf -m prep SDfile
Find this compound or compounds like it in BindingDB:
Activity Spreadsheet -- Enzyme Inhibition Constant Data from BindingDB
Found 11 hits for monomerid = 50703
TargetDual specificity protein phosphatase 6(Rattus norvegicus)
Sanford-Burnham Center For Chemical Genomics
Curated by PubChem BioAssay
LigandPNGBDBM50703(3-[1-(3,4-Dihydroxy-phenyl)-meth-(E)-ylidene]-4-im...)
Affinity DataIC50:  1.13E+5nM. Assay description: Data Source: Sanford-Burnham Center for Chemical Genomics (SBCCG) Source Affiliation: Sanford-Burnham Medical Research Institute (SBMRI, San Diego, C...
In DepthDetails PCBioAssay
TargetInduced myeloid leukemia cell differentiation protein Mcl-1(Homo sapiens (Human))
Emory University
Curated by PubChem BioAssay
LigandPNGBDBM50703(3-[1-(3,4-Dihydroxy-phenyl)-meth-(E)-ylidene]-4-im...)
Affinity DataIC50:  5.26E+3nM. Assay description: NIH Molecular Libraries Screening Centers Network [MLSCN] Emory Chemical Biology Discovery Center in MLSCN Assay provider: Nikolovska-Coleska, Univer...
In DepthDetails PCBioAssay
TargetDual specificity protein phosphatase 3(Homo sapiens (Human))
Burnham Center For Chemical Genomics
Curated by PubChem BioAssay
LigandPNGBDBM50703(3-[1-(3,4-Dihydroxy-phenyl)-meth-(E)-ylidene]-4-im...)
Affinity DataIC50:  4.57E+3nM. Assay description: Data Source: Sanford-Burnham Center for Chemical Genomics (SBCCG) Source Affiliation: Sanford-Burnham Medical Research Institute (SBMRI, San Diego, C...
In DepthDetails PCBioAssay
TargetM18 aspartyl aminopeptidase(Plasmodium falciparum 3D7)
The Scripps Research Institute Molecular Screening Center
Curated by PubChem BioAssay
LigandPNGBDBM50703(3-[1-(3,4-Dihydroxy-phenyl)-meth-(E)-ylidene]-4-im...)
Affinity DataIC50:  2.16E+3nM. Assay description: Source (MLPCN Center Name): The Scripps Research Institute Molecular Screening Center Affiliation: The Scripps Research Institute, TSRI Assay Provide...
In DepthDetails PCBioAssay
TargetProcathepsin L(Homo sapiens (Human))
The Scripps Research Institute Molecular Screening Center
Curated by PubChem BioAssay
LigandPNGBDBM50703(3-[1-(3,4-Dihydroxy-phenyl)-meth-(E)-ylidene]-4-im...)
Affinity DataIC50: >5.96E+4nM. Assay description: Source (MLPCN Center Name): The Scripps Research Institute Molecular Screening Center Affiliation: The Scripps Research Institute, TSRI Assay Provide...
In DepthDetails PCBioAssay
TargetIntestinal-type alkaline phosphatase 1(Rattus norvegicus (Rat))
Burnham Center For Chemical Genomics
Curated by PubChem BioAssay
LigandPNGBDBM50703(3-[1-(3,4-Dihydroxy-phenyl)-meth-(E)-ylidene]-4-im...)
Affinity DataEC50:  6.35E+3nM. Assay description: Data Source: Sanford-Burnham Center for Chemical Genomics (SBCCG) Source Affiliation: Sanford-Burnham Medical Research Institute (SBMRI, San Diego, C...
In DepthDetails PCBioAssay
TargetDual specificity protein phosphatase 3(Homo sapiens (Human))
Burnham Center For Chemical Genomics
Curated by PubChem BioAssay
LigandPNGBDBM50703(3-[1-(3,4-Dihydroxy-phenyl)-meth-(E)-ylidene]-4-im...)
Affinity DataIC50:  1.04E+4nM. Assay description: Data Source: Sanford-Burnham Center for Chemical Genomics (SBCCG) Source Affiliation: Sanford-Burnham Medical Research Institute (SBMRI, San Diego, C...
In DepthDetails PCBioAssay
TargetIntestinal-type alkaline phosphatase(Homo sapiens (Human))
Burnham Center For Chemical Genomics
Curated by PubChem BioAssay
LigandPNGBDBM50703(3-[1-(3,4-Dihydroxy-phenyl)-meth-(E)-ylidene]-4-im...)
Affinity DataEC50:  6.10E+4nM. Assay description: Data Source: Sanford-Burnham Center for Chemical Genomics (SBCCG) Source Affiliation: Sanford-Burnham Medical Research Institute (SBMRI, San Diego, C...
In DepthDetails PCBioAssay
TargetAlkaline phosphatase, germ cell type(Homo sapiens (Human))
Burnham Center For Chemical Genomics
Curated by PubChem BioAssay
LigandPNGBDBM50703(3-[1-(3,4-Dihydroxy-phenyl)-meth-(E)-ylidene]-4-im...)
Affinity DataEC50:  8.35E+4nM. Assay description: Data Source: Sanford-Burnham Center for Chemical Genomics (SBCCG) Source Affiliation: Sanford-Burnham Medical Research Institute (SBMRI, San Diego, C...
In DepthDetails PCBioAssay
TargetAlkaline phosphatase, tissue-nonspecific isozyme(Homo sapiens (Human))
Burnham Center For Chemical Genomics
Curated by PubChem BioAssay
LigandPNGBDBM50703(3-[1-(3,4-Dihydroxy-phenyl)-meth-(E)-ylidene]-4-im...)
Affinity DataEC50:  7.75E+4nM. Assay description: Data Source: Sanford-Burnham Center for Chemical Genomics (SBCCG) Source Affiliation: Sanford-Burnham Medical Research Institute (SBMRI, San Diego, C...
In DepthDetails PCBioAssay
TargetM1 family aminopeptidase(Plasmodium falciparum (isolate FcB1 / Columbia))
Srmlsc
Curated by PubChem BioAssay
LigandPNGBDBM50703(3-[1-(3,4-Dihydroxy-phenyl)-meth-(E)-ylidene]-4-im...)
Affinity DataIC50:  5.12E+4nM. Assay description: Southern Research Molecular Libraries Screening Center (SRMLSC) Southern Research Institute (Birmingham, Alabama) NIH Molecular Libraries Screening...
In DepthDetails PCBioAssay