BDBM50767 6-(1-piperidinyl)-2-(2-pyridinyl)benzo[de]isoquinoline-1,3-dione::6-piperidin-1-yl-2-pyridin-2-yl-benzo[de]isoquinoline-1,3-dione::6-piperidin-1-yl-2-pyridin-2-ylbenzo[de]isoquinoline-1,3-dione::6-piperidino-2-(2-pyridyl)benzo[de]isoquinoline-1,3-quinone::MLS000073536::SMR000008882::cid_653616
SMILES O=C1N(C(=O)c2ccc(N3CCCCC3)c3cccc1c23)c1ccccn1
InChI Key InChIKey=MXTZEBYRSNYSME-UHFFFAOYSA-N
Data  1 IC50  3 EC50
  Tab Delimited (TSV)   2D SDfile   Computed 3D by Vconf -m prep SDfile
Find this compound or compounds like it in BindingDB:
Activity Spreadsheet -- Enzyme Inhibition Constant Data from BindingDB
Found 4 hits for monomerid = 50767
TargetPOsterior Segregation(Caenorhabditis elegans)
Broad Institute
Curated by PubChem BioAssay
LigandPNGBDBM50767(6-(1-piperidinyl)-2-(2-pyridinyl)benzo[de]isoquino...)
Affinity DataEC50:  3.00E+5nM. Assay description: Broad Institute: MLPCN maternal gene expression Project ID: 2024 Keywords: Zinc finger, C. elegans, maternal gene expression, RNA-protein interac...
In DepthDetails PCBioAssay
TargetProtein LANA1(Human herpesvirus 8)
Broad Institute
Curated by PubChem BioAssay
LigandPNGBDBM50767(6-(1-piperidinyl)-2-(2-pyridinyl)benzo[de]isoquino...)
Affinity DataEC50: >7.50E+4nM. Assay description: Primary Collaborators: Kenneth Kaye,Brigham & Womens,Boston MA,kkaye@rics.bwh.harvard.edu,617-525-4256 Chantal Beauchemin,Brigham & Womens,Boston MA,...
In DepthDetails PCBioAssay
TargetGlycoprotein 42(Human herpesvirus 4 type 2)
Emory University
Curated by PubChem BioAssay
LigandPNGBDBM50767(6-(1-piperidinyl)-2-(2-pyridinyl)benzo[de]isoquino...)
Affinity DataIC50:  1.85E+3nM. Assay description: NIH Molecular Libraries Screening Centers Network [MLSCN] Emory Chemical Biology Discovery Center in MLSCN Assay provider: Theodore Jardetzky; Northw...
In DepthDetails PCBioAssay
TargetZinc finger protein mex-5(Caenorhabditis elegans)
Broad Institute
Curated by PubChem BioAssay
LigandPNGBDBM50767(6-(1-piperidinyl)-2-(2-pyridinyl)benzo[de]isoquino...)
Affinity DataEC50:  5.26E+3nM. Assay description: Broad Institute: MLPCN maternal gene expression Project ID: 2024 Keywords: Zinc finger, C. elegans, maternal gene expression, RNA-protein interac...
In DepthDetails PCBioAssay