BDBM50816 2-(2',5'-dioxo-1'-spiro[1,2-dihydroindene-3,4'-imidazolidine]yl)-N-(2-methoxy-3-dibenzofuranyl)acetamide::2-(2',5'-dioxospiro[1,2-dihydroindene-3,4'-imidazolidine]-1'-yl)-N-(2-methoxydibenzofuran-3-yl)acetamide::2-(2,5-diketospiro[imidazolidine-4,1'-indane]-1-yl)-N-(2-methoxydibenzofuran-3-yl)acetamide::2-[2',5'-bis(oxidanylidene)spiro[1,2-dihydroindene-3,4'-imidazolidine]-1'-yl]-N-(2-methoxydibenzofuran-3-yl)ethanamide::MLS000097710::SMR000063903::cid_2999672
SMILES COc1cc2c(cc1NC(=O)CN1C(=O)NC3(CCc4ccccc34)C1=O)oc1ccccc21
InChI Key InChIKey=IMYGPCCRJQSNBJ-UHFFFAOYSA-N
Data  2 IC50
  Tab Delimited (TSV)   2D SDfile   Computed 3D by Vconf -m prep SDfile
Find this compound or compounds like it in BindingDB:
Activity Spreadsheet -- Enzyme Inhibition Constant Data from BindingDB
Found 2 hits for monomerid = 50816
TargetMelanocortin receptor 4(Homo sapiens (Human))
The Scripps Research Institute Molecular Screening Center
Curated by PubChem BioAssay
LigandPNGBDBM50816(2-(2',5'-dioxo-1'-spiro[1,2-dihydroindene-3,4'-imi...)
Affinity DataIC50: >6.46E+4nM. Assay description: Source (MLPCN Center Name): The Scripps Research Institute Molecular Screening Center (SRISMC) Center Affiliation: The Scripps Research Institute, TS...
In DepthDetails PCBioAssay
TargetGlycoprotein 42(Human herpesvirus 4 type 2)
Emory University
Curated by PubChem BioAssay
LigandPNGBDBM50816(2-(2',5'-dioxo-1'-spiro[1,2-dihydroindene-3,4'-imi...)
Affinity DataIC50:  420nM. Assay description: NIH Molecular Libraries Screening Centers Network [MLSCN] Emory Chemical Biology Discovery Center in MLSCN Assay provider: Theodore Jardetzky; Northw...
In DepthDetails PCBioAssay