BDBM50886 5-(1-methyl-1H-phenanthro[9,10-d]imidazol-2-yl)-2-thiophenecarbaldehyde::5-(3-methyl-2-phenanthro[9,10-d]imidazolyl)-2-thiophenecarboxaldehyde::5-(3-methylphenanthr[9,10-d]imidazol-2-yl)thiophene-2-carbaldehyde::5-(3-methylphenanthro[9,10-d]imidazol-2-yl)thiophene-2-carbaldehyde::MLS000533905::SMR000141342::cid_875407
SMILES Cn1c(nc2c1c1ccccc1c1ccccc21)-c1ccc(C=O)s1
InChI Key InChIKey=WTHQGBYMMBPMJE-UHFFFAOYSA-N
Data  3 IC50
  Tab Delimited (TSV)   2D SDfile   Computed 3D by Vconf -m prep SDfile
Find this compound or compounds like it in BindingDB:
Activity Spreadsheet -- Enzyme Inhibition Constant Data from BindingDB
Found 3 hits for monomerid = 50886
TargetGlycoprotein 42(Human herpesvirus 4 type 2)
Emory University
Curated by PubChem BioAssay
LigandPNGBDBM50886(5-(1-methyl-1H-phenanthro[9,10-d]imidazol-2-yl)-2-...)
Affinity DataIC50:  2.54E+3nM. Assay description: NIH Molecular Libraries Screening Centers Network [MLSCN] Emory Chemical Biology Discovery Center in MLSCN Assay provider: Theodore Jardetzky; Northw...
In DepthDetails PCBioAssay
TargetProtein artemis(Homo sapiens (Human))
Burnham Center For Chemical Genomics
Curated by PubChem BioAssay
LigandPNGBDBM50886(5-(1-methyl-1H-phenanthro[9,10-d]imidazol-2-yl)-2-...)
Affinity DataIC50:  2.00E+4nM. Assay description: Data Source: Sanford-Burnham Center for Chemical Genomics (SBCCG) Source Affiliation: Sanford-Burnham Medical Research Institute (SBMRI, San Diego CA...
In DepthDetails PCBioAssay
TargetSUMO-conjugating enzyme UBC9(Homo sapiens (Human))
Burnham Center For Chemical Genomics
Curated by PubChem BioAssay
LigandPNGBDBM50886(5-(1-methyl-1H-phenanthro[9,10-d]imidazol-2-yl)-2-...)
Affinity DataIC50:  1.00E+5nM. Assay description: Data Source: Sanford-Burnham Center for Chemical Genomics (SBCCG) Source Affiliation: Sanford-Burnham Medical Research Institute (SBMRI, San Diego, C...
In DepthDetails PCBioAssay