BDBM50929 (E)-1-(1-benzotriazolyl)-3-(4-propan-2-ylphenyl)-2-propen-1-one::(E)-1-(benzotriazol-1-yl)-3-(4-propan-2-ylphenyl)prop-2-en-1-one::(E)-1-(benzotriazol-1-yl)-3-p-cumenyl-prop-2-en-1-one::1-[3-(4-isopropylphenyl)acryloyl]-1H-1,2,3-benzotriazole::MLS000543635::SMR000163707::cid_6016133
SMILES CC(C)c1ccc(\C=C\C(=O)n2nnc3ccccc23)cc1
InChI Key InChIKey=CHLPYSBWQNRNQT-FMIVXFBMSA-N
Data  1 IC50  1 EC50
  Tab Delimited (TSV)   2D SDfile   Computed 3D by Vconf -m prep SDfile
Find this compound or compounds like it in BindingDB:
Activity Spreadsheet -- Enzyme Inhibition Constant Data from BindingDB
Found 2 hits for monomerid = 50929
TargetHeat shock factor protein 1(Mus musculus)
Broad Institute
Curated by PubChem BioAssay
LigandPNGBDBM50929((E)-1-(1-benzotriazolyl)-3-(4-propan-2-ylphenyl)-2...)
Affinity DataEC50:  1.42E+4nM. Assay description: Keywords: Heat Shock Factor-1 (HSF-1), Stress Response, MG132, NIH3T3, Luminescence Assay Overview: Confirmation testing of small molecules identifie...
In DepthDetails PCBioAssay
TargetGlycoprotein 42(Human herpesvirus 4 type 2)
Emory University
Curated by PubChem BioAssay
LigandPNGBDBM50929((E)-1-(1-benzotriazolyl)-3-(4-propan-2-ylphenyl)-2...)
Affinity DataIC50:  420nM. Assay description: NIH Molecular Libraries Screening Centers Network [MLSCN] Emory Chemical Biology Discovery Center in MLSCN Assay provider: Theodore Jardetzky; Northw...
In DepthDetails PCBioAssay