BDBM51019 4-methyl-7-benzo[a]phenalenone::4-methyl-7H-benzo[de]anthracen-7-one::4-methylbenzo[a]phenalen-7-one::MLS000585787::SMR000204350::cid_232704
SMILES Cc1ccc2C(=O)c3ccccc3-c3cccc1c23
InChI Key InChIKey=XYHDOOKVEKKVFS-UHFFFAOYSA-N
Data  3 IC50
  Tab Delimited (TSV)   2D SDfile   Computed 3D by Vconf -m prep SDfile
Find this compound or compounds like it in BindingDB:
Activity Spreadsheet -- Enzyme Inhibition Constant Data from BindingDB
Found 3 hits for monomerid = 51019
TargetGlycoprotein 42(Human herpesvirus 4 type 2)
Emory University
Curated by PubChem BioAssay
LigandPNGBDBM51019(4-methyl-7-benzo[a]phenalenone | 4-methyl-7H-benzo...)
Affinity DataIC50:  2.51E+3nM. Assay description: NIH Molecular Libraries Screening Centers Network [MLSCN] Emory Chemical Biology Discovery Center in MLSCN Assay provider: Theodore Jardetzky; Northw...
In DepthDetails PCBioAssay
TargetFemale germline-specific tumor suppressor gld-1(Caenorhabditis elegans)
The Scripps Research Institute Molecular Screening Center
Curated by PubChem BioAssay
LigandPNGBDBM51019(4-methyl-7-benzo[a]phenalenone | 4-methyl-7H-benzo...)
Affinity DataIC50:  2.67E+3nM. Assay description: Source (MLPCN Center Name): The Scripps Research Institute Molecular Screening Center (SRIMSC) Affiliation: The Scripps Research Institute, TSRI Assa...
In DepthDetails PCBioAssay
TargetProtein Rev(Human immunodeficiency virus 1)
The Scripps Research Institute Molecular Screening Center
Curated by PubChem BioAssay
LigandPNGBDBM51019(4-methyl-7-benzo[a]phenalenone | 4-methyl-7H-benzo...)
Affinity DataIC50:  1.01E+4nM. Assay description: Source (MLPCN Center Name): The Scripps Research Institute Molecular Screening Center (SRIMSC) Affiliation: The Scripps Research Institute, TSRI Assa...
In DepthDetails PCBioAssay