BDBM51194 (1-pyrazin-2-ylethylideneamino) 3-(2,6-dichlorophenyl)-5-methyl-1,2-oxazole-4-carboxylate::(1-pyrazin-2-ylethylideneamino) 3-[2,6-bis(chloranyl)phenyl]-5-methyl-1,2-oxazole-4-carboxylate::3-(2,6-dichlorophenyl)-5-methyl-4-isoxazolecarboxylic acid [1-(2-pyrazinyl)ethylideneamino] ester::3-(2,6-dichlorophenyl)-5-methyl-isoxazole-4-carboxylic acid (1-pyrazin-2-ylethylideneamino) ester::MLS000696488::N-({[3-(2,6-dichlorophenyl)-5-methyl-4-isoxazolyl]carbonyl}oxy)-N-[(Z)-1-(2-pyrazinyl)ethylidene]amine::SMR000336605::cid_1481882
SMILES CC(=NOC(=O)c1c(C)onc1-c1c(Cl)cccc1Cl)c1cnccn1
InChI Key InChIKey=QKSCWBJGCHIALO-UHFFFAOYSA-N
Data  1 IC50
  Tab Delimited (TSV)   2D SDfile   Computed 3D by Vconf -m prep SDfile
Find this compound or compounds like it in BindingDB:
Activity Spreadsheet -- Enzyme Inhibition Constant Data from BindingDB
Found 1 hit for monomerid = 51194
TargetGlycoprotein 42(Human herpesvirus 4 type 2)
Emory University
Curated by PubChem BioAssay
LigandPNGBDBM51194((1-pyrazin-2-ylethylideneamino) 3-(2,6-dichlorophe...)
Affinity DataIC50:  1.48E+3nM. Assay description: NIH Molecular Libraries Screening Centers Network [MLSCN] Emory Chemical Biology Discovery Center in MLSCN Assay provider: Theodore Jardetzky; Northw...
In DepthDetails PCBioAssay