BDBM51203 5-benzamido-6-keto-2-[(E)-2-(4-phenoxyanilino)vinyl]pyran-3-carboxylic acid methyl ester::5-benzamido-6-oxo-2-[(E)-2-(4-phenoxyanilino)ethenyl]-3-pyrancarboxylic acid methyl ester::MLS000696053::SMR000334968::cid_5524036::methyl 3-(benzoylamino)-2-oxo-6-[(E)-2-(4-phenoxyanilino)ethenyl]-2H-pyran-5-carboxylate::methyl 5-benzamido-6-oxidanylidene-2-[(E)-2-[(4-phenoxyphenyl)amino]ethenyl]pyran-3-carboxylate::methyl 5-benzamido-6-oxo-2-[(E)-2-(4-phenoxyanilino)ethenyl]pyran-3-carboxylate
SMILES COC(=O)c1cc(NC(=O)c2ccccc2)c(=O)oc1CC=Nc1ccc(Oc2ccccc2)cc1
InChI Key InChIKey=DUQQEFNTIPIRJF-UHFFFAOYSA-N
Data  3 IC50
  Tab Delimited (TSV)   2D SDfile   Computed 3D by Vconf -m prep SDfile
Find this compound or compounds like it in BindingDB:
Activity Spreadsheet -- Enzyme Inhibition Constant Data from BindingDB
Found 3 hits for monomerid = 51203
TargetGlycoprotein 42(Human herpesvirus 4 type 2)
Emory University
Curated by PubChem BioAssay
LigandPNGBDBM51203(5-benzamido-6-keto-2-[(E)-2-(4-phenoxyanilino)viny...)
Affinity DataIC50:  4.19E+3nM. Assay description: NIH Molecular Libraries Screening Centers Network [MLSCN] Emory Chemical Biology Discovery Center in MLSCN Assay provider: Theodore Jardetzky; Northw...
In DepthDetails PCBioAssay
TargetPlectin(Homo sapiens (Human))
Burnham Center For Chemical Genomics
Curated by PubChem BioAssay
LigandPNGBDBM51203(5-benzamido-6-keto-2-[(E)-2-(4-phenoxyanilino)viny...)
Affinity DataIC50:  2.00E+5nM. Assay description: Data Source: Sanford-Burnham Center for Chemical Genomics (SBCCG) Source Affiliation: Sanford-Burnham Medical Research Institute (SBMRI, San Diego, C...
In DepthDetails PCBioAssay
TargetVoltage-dependent N-type calcium channel subunit alpha-1B(Homo sapiens (Human))
Burnham Center For Chemical Genomics
Curated by PubChem BioAssay
LigandPNGBDBM51203(5-benzamido-6-keto-2-[(E)-2-(4-phenoxyanilino)viny...)
Affinity DataIC50:  6.82E+3nM. Assay description: Data Source: Data Source: Sanford-Burnham Center for Chemical Genomics (SBCCG) Source Affiliation: Sanford-Burnham Medical Research Institute Network...
In DepthDetails PCBioAssay