BDBM51230 2-bromobenzoic acid (4-salicyloylazoanilino) ester::2-bromobenzoic acid [4-[(2-hydroxyphenyl)-oxomethyl]azoanilino] ester::MLS000774521::SMR000372063::[4-[(2-hydroxybenzoyl)diazenyl]anilino] 2-bromobenzoate::[[4-[(2-hydroxyphenyl)carbonyldiazenyl]phenyl]amino] 2-bromanylbenzoate::cid_2304813
SMILES Oc1ccccc1C(=O)\N=N\c1ccc(NOC(=O)c2ccccc2Br)cc1
InChI Key InChIKey=VSGHAONSTHREHE-GHVJWSGMSA-N
Data  1 IC50
  Tab Delimited (TSV)   2D SDfile   Computed 3D by Vconf -m prep SDfile
Find this compound or compounds like it in BindingDB:
Activity Spreadsheet -- Enzyme Inhibition Constant Data from BindingDB
Found 1 hit for monomerid = 51230
TargetGlycoprotein 42(Human herpesvirus 4 type 2)
Emory University
Curated by PubChem BioAssay
LigandPNGBDBM51230(2-bromobenzoic acid (4-salicyloylazoanilino) ester...)
Affinity DataIC50:  420nM. Assay description: NIH Molecular Libraries Screening Centers Network [MLSCN] Emory Chemical Biology Discovery Center in MLSCN Assay provider: Theodore Jardetzky; Northw...
In DepthDetails PCBioAssay