BDBM51241 MLS000332169::N-[3-Cyano-1-(3-methoxy-propyl)-8-methyl-10-oxo-1,10-dihydro-1,9,10a-triaza-anthracen-(2Z)-ylidene]- benzamide::N-[3-cyano-1-(3-methoxypropyl)-10-methyl-5-oxidanylidene-dipyrido[3,4-c:1',2'-f]pyrimidin-2-ylidene]benzamide::N-[3-cyano-1-(3-methoxypropyl)-10-methyl-5-oxo-2-dipyrido[3,4-c:1',2'-f]pyrimidinylidene]benzamide::N-[3-cyano-1-(3-methoxypropyl)-10-methyl-5-oxodipyrido[3,4-c:1',2'-f]pyrimidin-2-ylidene]benzamide::N-[3-cyano-5-keto-1-(3-methoxypropyl)-10-methyl-dipyrido[3,4-c:1',2'-f]pyrimidin-2-ylidene]benzamide::SMR000434912::cid_1865064
SMILES COCCCn1c2nc3c(C)cccn3c(=O)c2cc(C#N)\c1=N/C(=O)c1ccccc1
InChI Key InChIKey=SBZTVYDRWVPMTK-SZXQPVLSSA-N
Data  4 IC50  1 EC50
  Tab Delimited (TSV)   2D SDfile   Computed 3D by Vconf -m prep SDfile
Find this compound or compounds like it in BindingDB:
Activity Spreadsheet -- Enzyme Inhibition Constant Data from BindingDB
Found 5 hits for monomerid = 51241
TargetGlycoprotein 42(Human herpesvirus 4 type 2)
Emory University
Curated by PubChem BioAssay
LigandPNGBDBM51241(MLS000332169 | N-[3-Cyano-1-(3-methoxy-propyl)-8-m...)
Affinity DataIC50:  2.78E+3nM. Assay description: NIH Molecular Libraries Screening Centers Network [MLSCN] Emory Chemical Biology Discovery Center in MLSCN Assay provider: Theodore Jardetzky; Northw...
In DepthDetails PCBioAssay
TargetBeta-lactamase(Pseudomonas aeruginosa)
The Scripps Research Institute Molecular Screening Center
Curated by PubChem BioAssay
LigandPNGBDBM51241(MLS000332169 | N-[3-Cyano-1-(3-methoxy-propyl)-8-m...)
Affinity DataIC50: >5.96E+4nM. Assay description: Source (MLPCN Center Name): The Scripps Research Institute Molecular Screening Center (SRIMSC) Center Affiliation: The Scripps Research Institute (TS...
In DepthDetails PCBioAssay
TargetProtein LANA1(Human herpesvirus 8)
Broad Institute
Curated by PubChem BioAssay
LigandPNGBDBM51241(MLS000332169 | N-[3-Cyano-1-(3-methoxy-propyl)-8-m...)
Affinity DataEC50: >7.50E+4nM. Assay description: Primary Collaborators: Kenneth Kaye,Brigham & Womens,Boston MA,kkaye@rics.bwh.harvard.edu,617-525-4256 Chantal Beauchemin,Brigham & Womens,Boston MA,...
In DepthDetails PCBioAssay
TargetBeta-lactamase(Pseudomonas aeruginosa)
The Scripps Research Institute Molecular Screening Center
Curated by PubChem BioAssay
LigandPNGBDBM51241(MLS000332169 | N-[3-Cyano-1-(3-methoxy-propyl)-8-m...)
Affinity DataIC50: >5.96E+4nM. Assay description: Source (MLPCN Center Name): The Scripps Research Institute Molecular Screening Center (SRIMSC) Center Affiliation: The Scripps Research Institute (TS...
In DepthDetails PCBioAssay
TargetBeta-lactamase(Salmonella enterica subsp. enterica serovar Choler...)
The Scripps Research Institute Molecular Screening Center
Curated by PubChem BioAssay
LigandPNGBDBM51241(MLS000332169 | N-[3-Cyano-1-(3-methoxy-propyl)-8-m...)
Affinity DataIC50: >5.96E+4nM. Assay description: Source (MLPCN Center Name): The Scripps Research Institute Molecular Screening Center (SRIMSC) Center Affiliation: The Scripps Research Institute (TS...
In DepthDetails PCBioAssay