BDBM51242 8-Chloro-2,3-dihydro-1H,10H-phenothiazin-4-one::8-chloranyl-1,2,3,10-tetrahydrophenothiazin-4-one::8-chloro-1,2,3,10-tetrahydrophenothiazin-4-one::MLS000333002::SMR000436323::cid_762523
SMILES Clc1ccc2SC3C(=O)CCCC3=Nc2c1
InChI Key InChIKey=QXHGPKXXVDTTNH-UHFFFAOYSA-N
Data  3 IC50  2 EC50
  Tab Delimited (TSV)   2D SDfile   Computed 3D by Vconf -m prep SDfile
Find this compound or compounds like it in BindingDB:
Activity Spreadsheet -- Enzyme Inhibition Constant Data from BindingDB
Found 5 hits for monomerid = 51242
TargetZinc finger protein mex-5(Caenorhabditis elegans)
Broad Institute
Curated by PubChem BioAssay
LigandPNGBDBM51242(8-Chloro-2,3-dihydro-1H,10H-phenothiazin-4-one | 8...)
Affinity DataEC50:  8.90E+3nM. Assay description: Broad Institute: MLPCN maternal gene expression Project ID: 2024 Keywords: Zinc finger, C. elegans, maternal gene expression, RNA-protein interac...
In DepthDetails PCBioAssay
TargetGlycoprotein 42(Human herpesvirus 4 type 2)
Emory University
Curated by PubChem BioAssay
LigandPNGBDBM51242(8-Chloro-2,3-dihydro-1H,10H-phenothiazin-4-one | 8...)
Affinity DataIC50:  5.28E+3nM. Assay description: NIH Molecular Libraries Screening Centers Network [MLSCN] Emory Chemical Biology Discovery Center in MLSCN Assay provider: Theodore Jardetzky; Northw...
In DepthDetails PCBioAssay
TargetSentrin-specific protease 1(Homo sapiens (Human))
Burnham Center For Chemical Genomics
Curated by PubChem BioAssay
LigandPNGBDBM51242(8-Chloro-2,3-dihydro-1H,10H-phenothiazin-4-one | 8...)
Affinity DataIC50:  1.37E+4nM
In DepthDetails PCBioAssay
TargetSentrin-specific protease 1(Homo sapiens (Human))
Burnham Center For Chemical Genomics
Curated by PubChem BioAssay
LigandPNGBDBM51242(8-Chloro-2,3-dihydro-1H,10H-phenothiazin-4-one | 8...)
Affinity DataIC50:  1.71E+4nM
In DepthDetails PCBioAssay
TargetPOsterior Segregation(Caenorhabditis elegans)
Broad Institute
Curated by PubChem BioAssay
LigandPNGBDBM51242(8-Chloro-2,3-dihydro-1H,10H-phenothiazin-4-one | 8...)
Affinity DataEC50:  1.84E+4nM. Assay description: Broad Institute: MLPCN maternal gene expression Project ID: 2024 Keywords: Zinc finger, C. elegans, maternal gene expression, RNA-protein interac...
In DepthDetails PCBioAssay