BDBM51283 (1R,2R,3R,8aS)-6-Acetyl-3-carbamoyl-1-cyano-2-(4-fluoro-phenyl)-1,2,3,8a-tetrahydro-indolizine-1-car boxylic acid methyl ester::(1R,2R,3R,8aS)-6-acetyl-3-carbamoyl-1-cyano-2-(4-fluorophenyl)-3,8a-dihydro-2H-indolizine-1-carboxylic acid methyl ester::MLS001029786::SMR000427163::cid_11913734::methyl (1R,2R,3R,8aS)-3-aminocarbonyl-1-cyano-6-ethanoyl-2-(4-fluorophenyl)-3,8a-dihydro-2H-indolizine-1-carboxylate::methyl (1R,2R,3R,8aS)-6-acetyl-3-carbamoyl-1-cyano-2-(4-fluorophenyl)-3,8a-dihydro-2H-indolizine-1-carboxylate
SMILES COC(=O)[C@@]1(C#N)[C@@H]2C=CC(=CN2[C@H]([C@@H]1c1ccc(F)cc1)C(N)=O)C(C)=O
InChI Key InChIKey=JHDLKCMFSBPBOH-LJCCNALRSA-N
Data  3 IC50  2 EC50
  Tab Delimited (TSV)   2D SDfile   Computed 3D by Vconf -m prep SDfile
Find this compound or compounds like it in BindingDB:
Activity Spreadsheet -- Enzyme Inhibition Constant Data from BindingDB
Found 5 hits for monomerid = 51283
TargetZinc finger protein mex-5(Caenorhabditis elegans)
Broad Institute
Curated by PubChem BioAssay
LigandPNGBDBM51283((1R,2R,3R,8aS)-6-Acetyl-3-carbamoyl-1-cyano-2-(4-f...)
Affinity DataEC50:  1.14E+4nM. Assay description: Broad Institute: MLPCN maternal gene expression Project ID: 2024 Keywords: Zinc finger, C. elegans, maternal gene expression, RNA-protein interac...
In DepthDetails PCBioAssay
TargetGlycoprotein 42(Human herpesvirus 4 type 2)
Emory University
Curated by PubChem BioAssay
LigandPNGBDBM51283((1R,2R,3R,8aS)-6-Acetyl-3-carbamoyl-1-cyano-2-(4-f...)
Affinity DataIC50:  3.07E+3nM. Assay description: NIH Molecular Libraries Screening Centers Network [MLSCN] Emory Chemical Biology Discovery Center in MLSCN Assay provider: Theodore Jardetzky; Northw...
In DepthDetails PCBioAssay
TargetFemale germline-specific tumor suppressor gld-1(Caenorhabditis elegans)
The Scripps Research Institute Molecular Screening Center
Curated by PubChem BioAssay
LigandPNGBDBM51283((1R,2R,3R,8aS)-6-Acetyl-3-carbamoyl-1-cyano-2-(4-f...)
Affinity DataIC50:  1.51E+4nM. Assay description: Source (MLPCN Center Name): The Scripps Research Institute Molecular Screening Center (SRIMSC) Affiliation: The Scripps Research Institute, TSRI Assa...
In DepthDetails PCBioAssay
TargetProtein Rev(Human immunodeficiency virus 1)
The Scripps Research Institute Molecular Screening Center
Curated by PubChem BioAssay
LigandPNGBDBM51283((1R,2R,3R,8aS)-6-Acetyl-3-carbamoyl-1-cyano-2-(4-f...)
Affinity DataIC50:  1.83E+4nM. Assay description: Source (MLPCN Center Name): The Scripps Research Institute Molecular Screening Center (SRIMSC) Affiliation: The Scripps Research Institute, TSRI Assa...
In DepthDetails PCBioAssay
TargetPOsterior Segregation(Caenorhabditis elegans)
Broad Institute
Curated by PubChem BioAssay
LigandPNGBDBM51283((1R,2R,3R,8aS)-6-Acetyl-3-carbamoyl-1-cyano-2-(4-f...)
Affinity DataEC50:  4.60E+3nM. Assay description: Broad Institute: MLPCN maternal gene expression Project ID: 2024 Keywords: Zinc finger, C. elegans, maternal gene expression, RNA-protein interac...
In DepthDetails PCBioAssay