BDBM51310 6,7,12,15,15-pentamethyl-3,10-diazatetracyclo[10.2.1.0~2,11~.0~4,9~]pentadeca-2(11),3,5,7,9-pentaene-1-carboxylic acid::MLS000063296::SMR000074934::cid_2948211
SMILES Cc1cc2nc3c(nc2cc1C)C1(CCC3(C)C1(C)C)C(O)=O
InChI Key InChIKey=OVYNUABZJBLWSS-UHFFFAOYSA-N
Data  2 IC50
  Tab Delimited (TSV)   2D SDfile   Computed 3D by Vconf -m prep SDfile
Find this compound or compounds like it in BindingDB:
Activity Spreadsheet -- Enzyme Inhibition Constant Data from BindingDB
Found 2 hits for monomerid = 51310
TargetDNA repair protein RAD51 homolog 1(Homo sapiens (Human))
Pcmd
Curated by PubChem BioAssay
LigandPNGBDBM51310(6,7,12,15,15-pentamethyl-3,10-diazatetracyclo[10.2...)
Affinity DataIC50:  3.71E+4nM. Assay description: Project Title: A screen for modulators of human Rad51, a key DNA repair protein Application Number: MH084119 Assay Submitter: Dr. Alex Mazin Submitte...
In DepthDetails PCBioAssay
TargetDNA repair protein RAD51 homolog 1(Homo sapiens (Human))
Pcmd
Curated by PubChem BioAssay
LigandPNGBDBM51310(6,7,12,15,15-pentamethyl-3,10-diazatetracyclo[10.2...)
Affinity DataIC50:  8.50E+4nM. Assay description: Project Title: A screen for modulators of human Rad51, a key DNA repair protein Application Number: MH084119 Assay Submitter: Dr. Alex Mazin Submitte...
In DepthDetails PCBioAssay