BDBM51336 4-{2-[(2-chloro-4-nitrophenyl)thio]benzoyl}morpholine::MLS000662370::SMR000292908::[2-(2-chloranyl-4-nitro-phenyl)sulfanylphenyl]-morpholin-4-yl-methanone::[2-(2-chloro-4-nitrophenyl)sulfanylphenyl]-morpholin-4-ylmethanone::[2-[(2-chloro-4-nitro-phenyl)thio]phenyl]-morpholino-methanone::[2-[(2-chloro-4-nitrophenyl)thio]phenyl]-(4-morpholinyl)methanone::cid_1313981
SMILES [O-][N+](=O)c1ccc(Sc2ccccc2C(=O)N2CCOCC2)c(Cl)c1
InChI Key InChIKey=HXYXDUVHHBKBPS-UHFFFAOYSA-N
Data  1 IC50
  Tab Delimited (TSV)   2D SDfile   Computed 3D by Vconf -m prep SDfile
Find this compound or compounds like it in BindingDB:
Activity Spreadsheet -- Enzyme Inhibition Constant Data from BindingDB
Found 1 hit for monomerid = 51336
TargetDNA repair protein RAD51 homolog 1(Homo sapiens (Human))
Pcmd
Curated by PubChem BioAssay
LigandPNGBDBM51336(4-{2-[(2-chloro-4-nitrophenyl)thio]benzoyl}morphol...)
Affinity DataIC50:  5.30E+4nM. Assay description: Project Title: A screen for modulators of human Rad51, a key DNA repair protein Application Number: MH084119 Assay Submitter: Dr. Alex Mazin Submitte...
In DepthDetails PCBioAssay