BDBM51419 3-fluoranyl-N-(1H-1,2,4-triazol-5-yl)benzamide::3-fluoro-N-(1H-1,2,4-triazol-5-yl)benzamide::MLS-0315821.0002::cid_807820
SMILES Fc1cccc(c1)C(=O)Nc1nnc[nH]1
InChI Key InChIKey=AQERYHSAKUBTEX-UHFFFAOYSA-N
Data  2 EC50
  Tab Delimited (TSV)   2D SDfile   Computed 3D by Vconf -m prep SDfile
Find this compound or compounds like it in BindingDB:
Activity Spreadsheet -- Enzyme Inhibition Constant Data from BindingDB
Found 2 hits for monomerid = 51419
TargetAlkaline phosphatase, tissue-nonspecific isozyme(Homo sapiens (Human))
Burnham Center For Chemical Genomics
Curated by PubChem BioAssay
LigandPNGBDBM51419(3-fluoranyl-N-(1H-1,2,4-triazol-5-yl)benzamide | 3...)
Affinity DataEC50:  8.29E+3nM. Assay description: Data Source: Sanford-Burnham Center for Chemical Genomics (SBCCG) Source Affiliation: Sanford-Burnham Medical Research Institute (SBMRI, San Diego, C...
In DepthDetails PCBioAssay
TargetAlkaline phosphatase, tissue-nonspecific isozyme(Homo sapiens (Human))
Burnham Center For Chemical Genomics
Curated by PubChem BioAssay
LigandPNGBDBM51419(3-fluoranyl-N-(1H-1,2,4-triazol-5-yl)benzamide | 3...)
Affinity DataEC50:  7.50E+3nM. Assay description: Data Source: Sanford-Burnham Center for Chemical Genomics (SBCCG) Source Affiliation: Sanford-Burnham Medical Research Institute (SBMRI, San Diego, C...
In DepthDetails PCBioAssay