BDBM51432 2-chloranyl-5-nitro-N-(1H-1,2,4-triazol-5-yl)benzamide::2-chloro-5-nitro-N-(1H-1,2,4-triazol-5-yl)benzamide::MLS-0315823.0001::cid_3108183
SMILES [O-][N+](=O)c1ccc(Cl)c(c1)C(=O)Nc1nnc[nH]1
InChI Key InChIKey=XMAPXXOWOMQTLR-UHFFFAOYSA-N
Data  1 EC50
  Tab Delimited (TSV)   2D SDfile   Computed 3D by Vconf -m prep SDfile
Find this compound or compounds like it in BindingDB:
Activity Spreadsheet -- Enzyme Inhibition Constant Data from BindingDB
Found 1 hit for monomerid = 51432
TargetAlkaline phosphatase, tissue-nonspecific isozyme(Homo sapiens (Human))
Burnham Center For Chemical Genomics
Curated by PubChem BioAssay
LigandPNGBDBM51432(2-chloranyl-5-nitro-N-(1H-1,2,4-triazol-5-yl)benza...)
Affinity DataEC50:  3.68E+4nM. Assay description: Data Source: Sanford-Burnham Center for Chemical Genomics (SBCCG) Source Affiliation: Sanford-Burnham Medical Research Institute (SBMRI, San Diego, C...
In DepthDetails PCBioAssay