BDBM51434 2,2-bis(chloranyl)-1-methyl-N-(1H-1,2,4-triazol-5-yl)cyclopropane-1-carboxamide::2,2-dichloro-1-methyl-N-(1H-1,2,4-triazol-5-yl)-1-cyclopropanecarboxamide::2,2-dichloro-1-methyl-N-(1H-1,2,4-triazol-5-yl)cyclopropane-1-carboxamide::2,2-dichloro-1-methyl-N-(1H-1,2,4-triazol-5-yl)cyclopropanecarboxamide::MLS-0315825.0001::cid_560224
SMILES CC1(CC1(Cl)Cl)C(=O)Nc1nnc[nH]1
InChI Key InChIKey=ANYYSUIJYINPMK-UHFFFAOYSA-N
Data  1 EC50
  Tab Delimited (TSV)   2D SDfile   Computed 3D by Vconf -m prep SDfile
Find this compound or compounds like it in BindingDB:
Activity Spreadsheet -- Enzyme Inhibition Constant Data from BindingDB
Found 1 hit for monomerid = 51434
TargetAlkaline phosphatase, tissue-nonspecific isozyme(Homo sapiens (Human))
Burnham Center For Chemical Genomics
Curated by PubChem BioAssay
LigandPNGBDBM51434(2,2-bis(chloranyl)-1-methyl-N-(1H-1,2,4-triazol-5-...)
Affinity DataEC50:  1.00E+5nM. Assay description: Data Source: Sanford-Burnham Center for Chemical Genomics (SBCCG) Source Affiliation: Sanford-Burnham Medical Research Institute (SBMRI, San Diego, C...
In DepthDetails PCBioAssay