BDBM51509 2-azanylidene-N-butyl-10-methyl-5-oxidanylidene-1-(pyridin-4-ylmethyl)dipyrido[3,4-c:1',2'-f]pyrimidine-3-carboxamide::MLS000042707::N-butyl-2-imino-10-methyl-5-oxo-1-(pyridin-4-ylmethyl)-3-dipyrido[3,4-c:1',2'-f]pyrimidinecarboxamide::N-butyl-2-imino-10-methyl-5-oxo-1-(pyridin-4-ylmethyl)dipyrido[3,4-c:1',2'-f]pyrimidine-3-carboxamide::N-butyl-2-imino-5-keto-10-methyl-1-(4-pyridylmethyl)dipyrido[3,4-c:1',2'-f]pyrimidine-3-carboxamide::SMR000044628::cid_663729
SMILES CCCCNC(=O)c1cc2c(nc3c(C)cccn3c2=O)n(Cc2ccncc2)c1=N
InChI Key InChIKey=PPNHVIXAOOLGLO-UHFFFAOYSA-N
Data  1 IC50  3 EC50
  Tab Delimited (TSV)   2D SDfile   Computed 3D by Vconf -m prep SDfile
Find this compound or compounds like it in BindingDB:
Activity Spreadsheet -- Enzyme Inhibition Constant Data from BindingDB
Found 4 hits for monomerid = 51509
TargetPOsterior Segregation(Caenorhabditis elegans)
Broad Institute
Curated by PubChem BioAssay
LigandPNGBDBM51509(2-azanylidene-N-butyl-10-methyl-5-oxidanylidene-1-...)
Affinity DataEC50:  2.43E+4nM. Assay description: Broad Institute: MLPCN maternal gene expression Project ID: 2024 Keywords: Zinc finger, C. elegans, maternal gene expression, RNA-protein interac...
In DepthDetails PCBioAssay
TargetProbable global transcription activator SNF2L2(Homo sapiens (Human))
The Scripps Research Institute Molecular Screening Center
Curated by PubChem BioAssay
LigandPNGBDBM51509(2-azanylidene-N-butyl-10-methyl-5-oxidanylidene-1-...)
Affinity DataEC50:  9.11E+4nM
In DepthDetails PCBioAssay
TargetdTDP-4-dehydrorhamnose 3,5-epimerase(Mycobacterium tuberculosis H37Rv)
Pcmd
Curated by PubChem BioAssay
LigandPNGBDBM51509(2-azanylidene-N-butyl-10-methyl-5-oxidanylidene-1-...)
Affinity DataIC50:  5.46E+3nM. Assay description: Molecular Library Screening Center Network (MLSCN) Penn Center for Molecular Discovery (PCMD) Assay Provider: Michael McNeil, Colorado State Universi...
In DepthDetails PCBioAssay
TargetZinc finger protein mex-5(Caenorhabditis elegans)
Broad Institute
Curated by PubChem BioAssay
LigandPNGBDBM51509(2-azanylidene-N-butyl-10-methyl-5-oxidanylidene-1-...)
Affinity DataEC50:  3.96E+4nM. Assay description: Broad Institute: MLPCN maternal gene expression Project ID: 2024 Keywords: Zinc finger, C. elegans, maternal gene expression, RNA-protein interac...
In DepthDetails PCBioAssay