BDBM51587 MLS000120270::SMR000097187::[4-methyl-2-oxidanylidene-8-(propanoylamino)chromen-7-yl] propanoate::[4-methyl-2-oxo-8-(propanoylamino)chromen-7-yl] propanoate::cid_4223974::propanoic acid [4-methyl-2-oxo-8-(1-oxopropylamino)-1-benzopyran-7-yl] ester::propionic acid (2-keto-4-methyl-8-propionamido-chromen-7-yl) ester
SMILES CCC(=O)Nc1c(OC(=O)CC)ccc2c(C)cc(=O)oc12
InChI Key InChIKey=IBEIGVXFRAZZHD-UHFFFAOYSA-N
Data  1 IC50
  Tab Delimited (TSV)   2D SDfile   Computed 3D by Vconf -m prep SDfile
Find this compound or compounds like it in BindingDB:
Activity Spreadsheet -- Enzyme Inhibition Constant Data from BindingDB
Found 1 hit for monomerid = 51587
TargetdTDP-4-dehydrorhamnose 3,5-epimerase(Mycobacterium tuberculosis H37Rv)
Pcmd
Curated by PubChem BioAssay
LigandPNGBDBM51587(MLS000120270 | SMR000097187 | [4-methyl-2-oxidanyl...)
Affinity DataIC50:  678nM. Assay description: Molecular Library Screening Center Network (MLSCN) Penn Center for Molecular Discovery (PCMD) Assay Provider: Michael McNeil, Colorado State Universi...
In DepthDetails PCBioAssay