BDBM51599 3-[3-[(5-ethyl-[1,2,4]triazin[5,6-b]indol-3-yl)thio]propyl]-1H-benzimidazol-2-one::3-[3-[(5-ethyl-[1,2,4]triazino[5,6-b]indol-3-yl)sulfanyl]propyl]-1H-benzimidazol-2-one::3-[3-[(5-ethyl-[1,2,4]triazino[5,6-b]indol-3-yl)thio]propyl]-1H-benzimidazol-2-one::MLS000112822::SMR000108731::cid_5310786
SMILES CCn1c2ccccc2c2nnc(SCCCn3c4ccccc4[nH]c3=O)nc12
InChI Key InChIKey=ZVNFFJMAVRCTRS-UHFFFAOYSA-N
Data  1 KI  3 IC50
  Tab Delimited (TSV)   2D SDfile   Computed 3D by Vconf -m prep SDfile
Find this compound or compounds like it in BindingDB:
Activity Spreadsheet -- Enzyme Inhibition Constant Data from BindingDB
Found 4 hits for monomerid = 51599
TargetdTDP-4-dehydrorhamnose 3,5-epimerase(Mycobacterium tuberculosis H37Rv)
University Of Pennsylvania
Curated by ChEMBL
LigandPNGBDBM51599(3-[3-[(5-ethyl-[1,2,4]triazin[5,6-b]indol-3-yl)thi...)
Affinity DataKi:  100nM. Assay description: Inhibition of Mycobacterium tuberculosis RmlC expressed in Escherichia coli by spectrophotometry
In DepthDetails ArticlePubMed
TargetdTDP-4-dehydrorhamnose 3,5-epimerase(Mycobacterium tuberculosis H37Rv)
University Of Pennsylvania
Curated by ChEMBL
LigandPNGBDBM51599(3-[3-[(5-ethyl-[1,2,4]triazin[5,6-b]indol-3-yl)thi...)
Affinity DataIC50:  200nM. Assay description: Inhibition of Mycobacterium tuberculosis RmlC expressed in Escherichia coli by spectrophotometry
In DepthDetails ArticlePubMed
TargetdTDP-4-dehydrorhamnose 3,5-epimerase/reductase(Mycobacterium tuberculosis)
University Of Pennsylvania
Curated by ChEMBL
LigandPNGBDBM51599(3-[3-[(5-ethyl-[1,2,4]triazin[5,6-b]indol-3-yl)thi...)
Affinity DataIC50:  398nM. Assay description: Inhibition of Mycobacterium tuberculosis RmlC/RmlD expressed in Escherichia coli by spectrophotometry
In DepthDetails ArticlePubMed
TargetdTDP-4-dehydrorhamnose 3,5-epimerase(Mycobacterium tuberculosis H37Rv)
University Of Pennsylvania
Curated by ChEMBL
LigandPNGBDBM51599(3-[3-[(5-ethyl-[1,2,4]triazin[5,6-b]indol-3-yl)thi...)
Affinity DataIC50:  398nM. Assay description: Molecular Library Screening Center Network (MLSCN) Penn Center for Molecular Discovery (PCMD) Assay Provider: Michael McNeil, Colorado State Universi...
In DepthDetails PCBioAssay