BDBM51678 MLS000565982::N'-[(Z)-(4-chloranyl-2-phenylimino-1,3-thiazol-5-ylidene)methyl]-2-(2-ethoxyphenoxy)ethanehydrazide::N'-[(Z)-(4-chloro-2-phenylimino-1,3-thiazol-5-ylidene)methyl]-2-(2-ethoxyphenoxy)acetohydrazide::N'-[(Z)-(4-chloro-2-phenylimino-3-thiazolin-5-ylidene)methyl]-2-(2-ethoxyphenoxy)acetohydrazide::N'-[(Z)-(4-chloro-2-phenylimino-5-thiazolylidene)methyl]-2-(2-ethoxyphenoxy)acetohydrazide::SMR000153122::cid_6181153
SMILES CCOc1ccccc1OCC(=O)NN=Cc1sc(Nc2ccccc2)nc1Cl
InChI Key InChIKey=HCYYCTWKTBNBOC-UHFFFAOYSA-N
Data  3 IC50  1 EC50
  Tab Delimited (TSV)   2D SDfile   Computed 3D by Vconf -m prep SDfile
Find this compound or compounds like it in BindingDB:
Activity Spreadsheet -- Enzyme Inhibition Constant Data from BindingDB
Found 4 hits for monomerid = 51678
TargetdTDP-4-dehydrorhamnose 3,5-epimerase(Mycobacterium tuberculosis H37Rv)
Pcmd
Curated by PubChem BioAssay
LigandPNGBDBM51678(MLS000565982 | N'-[(Z)-(4-chloranyl-2-phenylimino-...)
Affinity DataIC50:  6.91E+3nM. Assay description: Molecular Library Screening Center Network (MLSCN) Penn Center for Molecular Discovery (PCMD) Assay Provider: Michael McNeil, Colorado State Universi...
In DepthDetails PCBioAssay
Target26S proteasome non-ATPase regulatory subunit 14(Homo sapiens (Human))
Burnham Center For Chemical Genomics
Curated by PubChem BioAssay
LigandPNGBDBM51678(MLS000565982 | N'-[(Z)-(4-chloranyl-2-phenylimino-...)
Affinity DataIC50:  1.74E+4nM. Assay description: Data Source: Sanford-Burnham Center for Chemical Genomics (SBCCG) Source Affiliation: Sanford Burnham Medical Research Institute (SBMRI, La Jolla, CA...
In DepthDetails PCBioAssay
TargetProthrombin(Bos taurus (Bovine))
Burnham Center For Chemical Genomics
Curated by PubChem BioAssay
LigandPNGBDBM51678(MLS000565982 | N'-[(Z)-(4-chloranyl-2-phenylimino-...)
Affinity DataIC50:  1.75E+4nM. Assay description: Data Source: Sanford-Burnham Center for Chemical Genomics (SBCCG) Source Affiliation: Sanford Burnham Medical Research Institute (SBMRI, La Jolla, CA...
In DepthDetails PCBioAssay
TargetStreptokinase A(Streptococcus pyogenes M1 GAS)
Broad Institute
Curated by PubChem BioAssay
LigandPNGBDBM51678(MLS000565982 | N'-[(Z)-(4-chloranyl-2-phenylimino-...)
Affinity DataEC50:  1.50E+5nM. Assay description: Keywords: Group A streptococcus, GAS, streptokinase, expression, virulence, inhibition, dose response, EC50 Assay Overview: The goal of this assa...
In DepthDetails PCBioAssay