BDBM51763 MLS000047204::N-cyclohexyl-2-[[5-[(E)-2-(dimethylamino)ethenyl]-3-methyl-1,2-oxazol-4-yl]sulfonyl-methyl-amino]ethanamide::N-cyclohexyl-2-[[5-[(E)-2-(dimethylamino)ethenyl]-3-methyl-1,2-oxazol-4-yl]sulfonyl-methylamino]acetamide::N-cyclohexyl-2-[[5-[(E)-2-(dimethylamino)ethenyl]-3-methyl-4-isoxazolyl]sulfonyl-methylamino]acetamide::N-cyclohexyl-2-[[5-[(E)-2-(dimethylamino)vinyl]-3-methyl-isoxazol-4-yl]sulfonyl-methyl-amino]acetamide::N~1~-cyclohexyl-N~2~-({5-[(E)-2-(dimethylamino)vinyl]-3-methylisoxazol-4-yl}sulfonyl)-N~2~-methylglycinamide::SMR000033215::cid_5771361
SMILES CN(C)\C=C\c1onc(C)c1S(=O)(=O)N(C)CC(=O)NC1CCCCC1
InChI Key InChIKey=IYMPINVGDSIIBV-ZHACJKMWSA-N
Data  1 EC50
  Tab Delimited (TSV)   2D SDfile   Computed 3D by Vconf -m prep SDfile
Find this compound or compounds like it in BindingDB:
Activity Spreadsheet -- Enzyme Inhibition Constant Data from BindingDB
Found 1 hit for monomerid = 51763
TargetSolute carrier family 12 member 5(Homo sapiens (Human))
Vanderbilt Screening Center For Gpcrs, Ion Channels And Transporters
Curated by PubChem BioAssay
LigandPNGBDBM51763(MLS000047204 | N-cyclohexyl-2-[[5-[(E)-2-(dimethyl...)
Affinity DataEC50:  610nM. Assay description: Vanderbilt Screening Center for GPCRs, Ion Channels and Transporters Assay Provider: Eric Delpire Assay Provider Affliation: Vanderbilt University Gr...
In DepthDetails PCBioAssay