BDBM51834 1-[(2-keto-6-methyl-1H-quinolin-3-yl)methyl]-3-(4-methoxyphenyl)-1-(tetrahydrofurfuryl)urea::3-(4-methoxyphenyl)-1-[(6-methyl-2-oxidanylidene-1H-quinolin-3-yl)methyl]-1-(oxolan-2-ylmethyl)urea::3-(4-methoxyphenyl)-1-[(6-methyl-2-oxo-1H-quinolin-3-yl)methyl]-1-(2-oxolanylmethyl)urea::3-(4-methoxyphenyl)-1-[(6-methyl-2-oxo-1H-quinolin-3-yl)methyl]-1-(oxolan-2-ylmethyl)urea::MLS000856593::SMR000274950::cid_3195134
SMILES COc1ccc(NC(=O)N(CC2CCCO2)Cc2cc3cc(C)ccc3[nH]c2=O)cc1
InChI Key InChIKey=ZSMAQRGEIAZXNB-UHFFFAOYSA-N
Data  2 EC50
  Tab Delimited (TSV)   2D SDfile   Computed 3D by Vconf -m prep SDfile
Find this compound or compounds like it in BindingDB:
Activity Spreadsheet -- Enzyme Inhibition Constant Data from BindingDB
Found 2 hits for monomerid = 51834
LigandPNGBDBM51834(1-[(2-keto-6-methyl-1H-quinolin-3-yl)methyl]-3-(4-...)
Affinity DataEC50:  3.00E+4nM. Assay description: University of New Mexico Assay Overview: Assay Support: 1R03MH084830-01 Project Title: TR-FRET HTS Assay for Inhibitors of MEKK2-MEK5 PB1 Domain...
In DepthDetails PCBioAssay
LigandPNGBDBM51834(1-[(2-keto-6-methyl-1H-quinolin-3-yl)methyl]-3-(4-...)
Affinity DataEC50:  3.00E+4nM. Assay description: University of New Mexico Assay Overview: Assay Support: 1R03MH084830-01 Project Title: TR-FRET HTS Assay for Inhibitors of MEKK2-MEK5 PB1 Domain...
In DepthDetails PCBioAssay