BDBM51837 MLS000708420::N-[4-(dimethylamino)phenyl]-2-(4-hydroxy-4-phenyl-1-piperidinyl)acetamide::N-[4-(dimethylamino)phenyl]-2-(4-hydroxy-4-phenyl-piperidino)acetamide::N-[4-(dimethylamino)phenyl]-2-(4-hydroxy-4-phenylpiperidin-1-yl)acetamide::N-[4-(dimethylamino)phenyl]-2-(4-oxidanyl-4-phenyl-piperidin-1-yl)ethanamide::SMR000287887::cid_3228763
SMILES CN(C)c1ccc(NC(=O)CN2CCC(O)(CC2)c2ccccc2)cc1
InChI Key InChIKey=OOQMLSFVLCKNSL-UHFFFAOYSA-N
Data  2 EC50
  Tab Delimited (TSV)   2D SDfile   Computed 3D by Vconf -m prep SDfile
Find this compound or compounds like it in BindingDB:
Activity Spreadsheet -- Enzyme Inhibition Constant Data from BindingDB
Found 2 hits for monomerid = 51837
LigandPNGBDBM51837(MLS000708420 | N-[4-(dimethylamino)phenyl]-2-(4-hy...)
Affinity DataEC50:  3.00E+4nM. Assay description: University of New Mexico Assay Overview: Assay Support: 1R03MH084830-01 Project Title: TR-FRET HTS Assay for Inhibitors of MEKK2-MEK5 PB1 Domain...
In DepthDetails PCBioAssay
LigandPNGBDBM51837(MLS000708420 | N-[4-(dimethylamino)phenyl]-2-(4-hy...)
Affinity DataEC50:  3.00E+4nM. Assay description: University of New Mexico Assay Overview: Assay Support: 1R03MH084830-01 Project Title: TR-FRET HTS Assay for Inhibitors of MEKK2-MEK5 PB1 Domain...
In DepthDetails PCBioAssay