BDBM51839 5,6-dimethyl-4-(propylthio)thieno[2,3-d]pyrimidine::5,6-dimethyl-4-propylsulfanyl-thieno[2,3-d]pyrimidine::5,6-dimethyl-4-propylsulfanylthieno[2,3-d]pyrimidine::MLS000717784::SMR000279152::cid_1569243
SMILES CCCSc1ncnc2sc(C)c(C)c12
InChI Key InChIKey=XAJFMVSCXOXHEX-UHFFFAOYSA-N
Data  2 EC50
  Tab Delimited (TSV)   2D SDfile   Computed 3D by Vconf -m prep SDfile
Find this compound or compounds like it in BindingDB:
Activity Spreadsheet -- Enzyme Inhibition Constant Data from BindingDB
Found 2 hits for monomerid = 51839
LigandPNGBDBM51839(5,6-dimethyl-4-(propylthio)thieno[2,3-d]pyrimidine...)
Affinity DataEC50:  3.00E+4nM. Assay description: University of New Mexico Assay Overview: Assay Support: 1R03MH084830-01 Project Title: TR-FRET HTS Assay for Inhibitors of MEKK2-MEK5 PB1 Domain...
In DepthDetails PCBioAssay
LigandPNGBDBM51839(5,6-dimethyl-4-(propylthio)thieno[2,3-d]pyrimidine...)
Affinity DataEC50:  3.00E+4nM. Assay description: University of New Mexico Assay Overview: Assay Support: 1R03MH084830-01 Project Title: TR-FRET HTS Assay for Inhibitors of MEKK2-MEK5 PB1 Domain...
In DepthDetails PCBioAssay