BDBM51856 2-(diethylamino)ethyl 4-[(1-phenyl-3-thiophen-2-yl-pyrazol-4-yl)carbonylamino]benzoate;hydrochloride::2-(diethylamino)ethyl 4-[(1-phenyl-3-thiophen-2-ylpyrazole-4-carbonyl)amino]benzoate;hydrochloride::4-[[1-phenyl-3-(2-thienyl)pyrazole-4-carbonyl]amino]benzoic acid 2-(diethylamino)ethyl ester;hydrochloride::4-[[oxo-(1-phenyl-3-thiophen-2-yl-4-pyrazolyl)methyl]amino]benzoic acid 2-(diethylamino)ethyl ester;hydrochloride::MLS001018442::SMR000354726::cid_16196245
SMILES CCN(CC)CCOC(=O)c1ccc(NC(=O)c2cn(nc2-c2cccs2)-c2ccccc2)cc1
InChI Key InChIKey=XTAJNRYOMCJSHW-UHFFFAOYSA-N
Data  3 IC50  2 EC50
  Tab Delimited (TSV)   2D SDfile   Computed 3D by Vconf -m prep SDfile
Find this compound or compounds like it in BindingDB:
Activity Spreadsheet -- Enzyme Inhibition Constant Data from BindingDB
Found 5 hits for monomerid = 51856
LigandPNGBDBM51856(2-(diethylamino)ethyl 4-[(1-phenyl-3-thiophen-2-yl...)
Affinity DataEC50:  3.00E+4nM. Assay description: University of New Mexico Assay Overview: Assay Support: 1R03MH084830-01 Project Title: TR-FRET HTS Assay for Inhibitors of MEKK2-MEK5 PB1 Domain...
In DepthDetails PCBioAssay
LigandPNGBDBM51856(2-(diethylamino)ethyl 4-[(1-phenyl-3-thiophen-2-yl...)
Affinity DataEC50:  3.00E+4nM. Assay description: University of New Mexico Assay Overview: Assay Support: 1R03MH084830-01 Project Title: TR-FRET HTS Assay for Inhibitors of MEKK2-MEK5 PB1 Domain...
In DepthDetails PCBioAssay
TargetUbiquitin-conjugating enzyme E2 N(Homo sapiens (Human))
Burnham Center For Chemical Genomics
Curated by PubChem BioAssay
LigandPNGBDBM51856(2-(diethylamino)ethyl 4-[(1-phenyl-3-thiophen-2-yl...)
Affinity DataIC50: >2.00E+4nM. Assay description: Data Source: Sanford-Burnham Center for Chemical Genomics (SBCCG) Source Affiliation: Sanford-Burnham Medical Research Institute (SBMRI, San Diego CA...
In DepthDetails PCBioAssay
TargetBcl-2-related protein A1(Mus musculus (Mouse))
Burnham Center For Chemical Genomics
Curated by PubChem BioAssay
LigandPNGBDBM51856(2-(diethylamino)ethyl 4-[(1-phenyl-3-thiophen-2-yl...)
Affinity DataIC50: >2.00E+4nM. Assay description: Data Source: Sanford-Burnham Center for Chemical Genomics (SBCCG) Source Affiliation: Sanford-Burnham Medical Research Institute (SBMRI, San Diego CA...
In DepthDetails PCBioAssay
TargetUbiquitin-conjugating enzyme E2 N(Homo sapiens (Human))
Burnham Center For Chemical Genomics
Curated by PubChem BioAssay
LigandPNGBDBM51856(2-(diethylamino)ethyl 4-[(1-phenyl-3-thiophen-2-yl...)
Affinity DataIC50:  8.78E+3nM. Assay description: Data Source: Sanford-Burnham Center for Chemical Genomics (SBCCG) Source Affiliation: Sanford-Burnham Medical Research Institute (SBMRI, San Diego CA...
In DepthDetails PCBioAssay