BDBM51916 2-(2,7-dipropoxy-9H-fluoren-9-ylidene)hydrazinecarboximidamide::2-[(2,7-dipropoxy-9-fluorenylidene)amino]guanidine;hydrochloride::2-[(2,7-dipropoxyfluoren-9-ylidene)amino]guanidine;hydrochloride::MLS001194769::SMR000554865::cid_24761588
SMILES [#6]-[#6]-[#6]-[#8]-c1ccc2-c3ccc(-[#8]-[#6]-[#6]-[#6])cc3\[#6](=[#7]\[#7]=[#6](\[#7])-[#7])-c2c1
InChI Key InChIKey=BQRGVCUSYIEHMO-UHFFFAOYSA-N
Data  1 IC50  2 EC50
  Tab Delimited (TSV)   2D SDfile   Computed 3D by Vconf -m prep SDfile
Find this compound or compounds like it in BindingDB:
Activity Spreadsheet -- Enzyme Inhibition Constant Data from BindingDB
Found 3 hits for monomerid = 51916
LigandPNGBDBM51916(2-(2,7-dipropoxy-9H-fluoren-9-ylidene)hydrazinecar...)
Affinity DataEC50:  9.98E+3nM. Assay description: University of New Mexico Assay Overview: Assay Support: 1R03MH084830-01 Project Title: TR-FRET HTS Assay for Inhibitors of MEKK2-MEK5 PB1 Domain...
In DepthDetails PCBioAssay
TargetMitochondrial import inner membrane translocase subunit TIM10(Saccharomyces cerevisiae S288c)
Burnham Center For Chemical Genomics
Curated by PubChem BioAssay
LigandPNGBDBM51916(2-(2,7-dipropoxy-9H-fluoren-9-ylidene)hydrazinecar...)
Affinity DataIC50:  1.98E+4nM. Assay description: Data Source: Sanford-Burnham Center for Chemical Genomics (SBCCG) Source Affiliation: Sanford-Burnham Medical Research Institute(SBMRI, San Diego, CA...
In DepthDetails PCBioAssay
LigandPNGBDBM51916(2-(2,7-dipropoxy-9H-fluoren-9-ylidene)hydrazinecar...)
Affinity DataEC50:  4.59E+3nM. Assay description: University of New Mexico Assay Overview: Assay Support: 1R03MH084830-01 Project Title: TR-FRET HTS Assay for Inhibitors of MEKK2-MEK5 PB1 Domain...
In DepthDetails PCBioAssay