BDBM52051 MLS001232912::N-[5-[2-(furan-2-ylmethylamino)-2-oxidanylidene-ethyl]sulfanyl-1,3,4-thiadiazol-2-yl]-2-methyl-benzamide::N-[5-[2-(furan-2-ylmethylamino)-2-oxoethyl]sulfanyl-1,3,4-thiadiazol-2-yl]-2-methylbenzamide::N-[5-[[2-(2-furanylmethylamino)-2-oxoethyl]thio]-1,3,4-thiadiazol-2-yl]-2-methylbenzamide::N-[5-[[2-(2-furfurylamino)-2-keto-ethyl]thio]-1,3,4-thiadiazol-2-yl]-2-methyl-benzamide::SMR000806356::cid_7190975
SMILES Cc1ccccc1C(=O)Nc1nnc(SCC(=O)NCc2ccco2)s1
InChI Key InChIKey=AOSGNNDJYHWGSG-UHFFFAOYSA-N
Data  4 IC50
  Tab Delimited (TSV)   2D SDfile   Computed 3D by Vconf -m prep SDfile
Find this compound or compounds like it in BindingDB:
Activity Spreadsheet -- Enzyme Inhibition Constant Data from BindingDB
Found 4 hits for monomerid = 52051
TargetBeta-lactamase(Pseudomonas aeruginosa)
The Scripps Research Institute Molecular Screening Center
Curated by PubChem BioAssay
LigandPNGBDBM52051(MLS001232912 | N-[5-[2-(furan-2-ylmethylamino)-2-o...)
Affinity DataIC50:  3.01E+3nM. Assay description: Source (MLPCN Center Name): The Scripps Research Institute Molecular Screening Center (SRIMSC) Center Affiliation: The Scripps Research Institute (TS...
In DepthDetails PCBioAssay
TargetBeta-lactamase(Pseudomonas aeruginosa)
The Scripps Research Institute Molecular Screening Center
Curated by PubChem BioAssay
LigandPNGBDBM52051(MLS001232912 | N-[5-[2-(furan-2-ylmethylamino)-2-o...)
Affinity DataIC50:  5.96E+4nM. Assay description: Source (MLPCN Center Name): The Scripps Research Institute Molecular Screening Center (SRIMSC) Center Affiliation: The Scripps Research Institute (TS...
In DepthDetails PCBioAssay
TargetBeta-lactamase(Pseudomonas aeruginosa)
The Scripps Research Institute Molecular Screening Center
Curated by PubChem BioAssay
LigandPNGBDBM52051(MLS001232912 | N-[5-[2-(furan-2-ylmethylamino)-2-o...)
Affinity DataIC50:  1.12E+3nM. Assay description: Source (MLPCN Center Name): The Scripps Research Institute Molecular Screening Center (SRIMSC) Center Affiliation: The Scripps Research Institute (TS...
In DepthDetails PCBioAssay
TargetBeta-lactamase(Pseudomonas aeruginosa)
The Scripps Research Institute Molecular Screening Center
Curated by PubChem BioAssay
LigandPNGBDBM52051(MLS001232912 | N-[5-[2-(furan-2-ylmethylamino)-2-o...)
Affinity DataIC50:  5.96E+4nM. Assay description: Source (MLPCN Center Name): The Scripps Research Institute Molecular Screening Center (SRIMSC) Center Affiliation: The Scripps Research Institute (TS...
In DepthDetails PCBioAssay